program: Gaussian 09
title: 000182612
version: EM64L-G09RevD.01
frameworkgroup: C1[X(C5H14NO3P)]
method: RPBEPBE
basis: SDD
operation: Freq
keyword: #p
keyword: freq=noraman
keyword: PBEPBE/SDD
title: #p freq=noraman PBEPBE/SDD
converged: NO YES NO NO
title: Mulliken charges:
elementType: P O O O N C C C C C H H H H H H H H H H H H H H
charge: 1.167721 -0.679603 -0.703545 -0.636979 -0.532258 -0.397699 -0.033825 -0.431408 -0.716852 -0.708132 0.218826 0.230564 0.234708 0.317012 0.202739 0.244426 0.213250 0.216355 0.203662 0.219014 0.285662 0.318547 0.381941 0.385874
chargesum: 0.00000
title: Mulliken charges with hydrogens summed into heavy atoms:
elementType: P O O O N C C C C C
charge: 1.167721 -0.297662 -0.317670 -0.636979 0.071951 0.051691 0.200883 -0.114396 -0.056437 -0.069101
polarizability: 1.03669114e+02 7.60175469e-01 9.95458980e+01 1.17892285e-01 -1.99864317e+00 8.58414871e+01
1716.lowfreq: -13.7762 -2.9443 -0.0024 -0.0022 -0.0017 8.4847 26.7963 51.9215 88.0415
frequency: 26.7506 51.6538 87.9914 99.8332 127.8542 138.0673 191.1960 213.4451 226.5984 242.2348 255.4834 290.0781 328.9332 331.7442 349.5924 369.4335 393.9782 409.3555 472.4160 482.6272 541.2751 645.4550 669.7038 700.7995 816.3972 882.0531 918.9975 929.6031 959.5032 963.0100 964.3137 1004.2639 1048.0678 1085.2462 1118.9997 1168.5829 1180.8821 1191.4339 1234.2166 1270.6740 1309.7422 1337.3334 1344.4911 1369.5475 1379.9073 1395.6248 1449.7597 1465.9930 1473.3025 1480.6275 1496.0993 1655.1250 2967.3944 2968.5309 2969.9228 2974.6896 3031.3290 3058.1660 3060.3278 3067.3596 3074.1616 3077.1333 3480.8090 3576.2127 3601.1072 3607.0598
redmass: 5.3508 2.6462 3.9650 2.3879 3.1372 3.4048 2.3048 1.0969 1.4537 3.1134 2.7555 2.5330 3.2092 1.9548 1.2930 1.4386 2.1365 3.2173 3.2804 2.3888 3.5053 2.2408 3.1569 6.8071 2.5999 1.4399 1.2157 1.7828 1.9874 1.4915 1.2096 2.0772 1.8478 1.6178 2.1512 2.0030 1.8525 1.9254 1.4491 1.2970 1.3710 1.3253 1.3590 1.4247 1.2652 1.2143 1.0802 1.0538 1.0464 1.0578 1.0463 1.0940 1.0394 1.0490 1.0622 1.0635 1.0994 1.0896 1.0987 1.0985 1.0996 1.0993 1.0452 1.0661 1.0662 1.0989
irintensity: 1.2251 0.3256 0.6443 17.0054 3.6770 4.4021 5.6528 0.2598 9.7307 78.3930 3.2830 7.3244 91.0375 11.4792 225.9652 5.5508 10.9649 7.0606 3.8561 9.0986 12.9346 419.0808 153.3666 246.6092 2.6471 19.7530 3.1607 0.8911 8.2965 1.9675 46.1525 12.2993 96.4899 26.7595 10.2337 28.6482 6.8525 18.5237 9.1815 18.5003 4.4131 0.7689 3.6568 13.1879 13.0438 18.5719 1.7246 3.4633 8.4574 6.4923 19.8086 62.7237 18.8972 40.5881 3.6087 34.0760 10.8912 5.4820 11.5444 66.0259 36.3841 45.0694 14.7830 32.8272 39.7263 13.7581
temp: 298.150 k
press: 1.00000 atm
elementType: 15 8 8 8 7 6 6 6 6 6 1 1 1 1 1 1 1 1 1 1 1 1 1 1
symmnumber: 1
zpe: 514720.2 jmol-1
zpe.correction: 0.196047 hartree
zpe.thermalcorrener: 0.210256 hartree
zpe.thermalcorrenthalpy: 0.211200 hartree
zpe.thermalcorrgfe: 0.155167 hartree
zpe.sumelectzpe: -819.736127 hartree
zpe.sumelectthermal: -819.721918 hartree
zpe.sumelectthermalent: -819.720974 hartree
zpe.sumelectthermalfe: -819.777006 hartree
dipole: 0.2654 0.6313 -0.5807
dipole: 0.8978
quadrupole: -62.0729 -64.7367 -78.4667
quadrupole: -0.1050 -0.0158 5.0990
quadrupole: 6.3525 3.6888 -10.0413 -0.1050 -0.0158 5.0990
hfenergy: -819.9321734 hartree
pointgroup: C01 [X(C5H14N1O3P1)]
dipole: 0.119341 0.2044854 -0.2621267 debye
dipolederiv: 1.9082549 -0.0303811 0.0241749 0.1383145 1.2826351 0.2210056 -0.0837561 0.3631943 1.2507665 -0.7508656 -0.0030226 0.0136584 -0.0535682 -1.0662117 -0.2905016 -0.0265905 -0.4145005 -0.5945605 -1.2701501 -0.0007956 0.1307093 -0.1095524 -0.5664806 -0.1257343 0.1753857 -0.0812944 -0.5507603 -0.7360275 0.1406525 -0.0957831 0.0349843 -0.6877209 0.1017773 0.0393201 0.0892558 -0.7641957 -0.5074001 -0.1255273 -0.0543949 0.0497926 -1.1093306 0.349495 -0.071736 0.3472948 -0.3425512 -0.031261 -0.0615213 0.049618 0.0385742 -0.0182956 -0.0190329 -0.0258242 0.0886951 0.060175 0.1276894 0.019578 0.0098597 0.0155571 0.0977105 0.0131441 0.0467469 -0.0027457 0.1138047 0.2706993 0.0424132 0.0712563 -0.219881 1.1282284 -0.3554211 0.1029065 -0.2690131 0.1126063 0.0029428 -0.0167694 0.0208769 -0.0410369 0.0462763 -0.0871684 0.0025992 -0.0757348 -0.0757313 -0.030604 0.0021696 0.0522838 -0.0257918 0.0825514 -0.0329485 0.0446129 -0.0449556 0.0238974 0.0411283 -0.057749 -0.0527586 -0.040187 0.0327971 -0.0685288 -0.0344313 -0.101586 -0.1042656 -0.0270325 0.1053898 -0.042718 0.0755864 -0.0501654 0.0619596 -0.0069756 0.0682584 0.0475583 -0.0144561 0.0772829 -0.0490554 0.0857821 -0.0587237 0.0470284 -0.0631743 0.0456102 -0.0164716 0.0522243 0.049902 -0.0425889 0.0451383 -0.0462034 0.0032133 -0.0352652 -0.0062014 -0.0697121 0.0485072 0.0541777 -0.0657941 0.1036518 -0.06828 0.1267887 -0.0523521 0.0548091 0.0049335 -0.0286099 0.0702422 0.1161107 0.0572967 0.0701033 -0.0307065 0.1145884 -0.0299582 0.0069951 -0.0559373 -0.143029 -0.0303238 -0.1516264 -0.0509591 -0.0109434 0.0154064 0.0253011 0.0800297 -0.0631088 -0.1027076 0.0339812 -0.1577801 -0.0699805 0.0252359 0.0164088 -0.0061455 0.0914075 0.0107804 0.0679419 -0.0130304 0.1284315 -0.0604375 0.0681564 -0.0684023 0.1128529 0.0218892 0.0684338 -0.0157737 -0.0741183 0.0036173 0.0624497 -0.0872441 -0.0203062 -0.0780669 -0.1452537 0.2409327 -0.0951894 0.0322363 -0.0550239 0.306262 -0.0310295 0.0207607 -0.107505 0.0685696 0.103204 -0.0518302 0.0790434 -0.009151 0.2832166 -0.1119494 0.0253861 -0.1740332 0.300721 0.3692764 -0.0008812 -0.0492278 0.0322492 0.1843832 0.1122516 -0.0616829 0.083278 0.2181438 0.2713796 0.0754276 -0.0640159 0.0546229 0.2761755 0.1211525 -0.0536249 0.1131907 0.2620044 unknown
polarizability: 103.7551092|0.3213263|98.6261703|-0.4507084|-3.8179826|86.6752199 unknown
InChI: InChI=1S/C5H14NO3P/c1-4(2)3-5(6)10(7,8)9/h4-5,7-8H,3,6H2,1-2H3
charge 0 multiplicity 1
24 atoms
P  1.363704 -0.6635 0.260994
O  0.963346 -2.003437 -0.796992
O  2.979173 -0.200487 -0.230124
O  1.282345 -1.050555 1.81268
N  1.150716 2.035575 -0.614705
C  -0.958368 1.001378 0.143476
C  -1.907967 -0.225893 0.180235
C  0.387843 0.818982 -0.585066
C  -2.286536 -0.714302 -1.238322
C  -3.172235 0.139398 0.994724
H  -0.757047 1.330545 1.184064
H  -1.473007 1.837534 -0.370234
H  -1.396713 -1.055206 0.711904
H  0.246228 0.427295 -1.606031
H  -2.737485 0.10707 -1.82905
H  -1.410378 -1.104111 -1.786114
H  -3.0285 -1.531999 -1.178574
H  -3.857095 -0.725153 1.066299
H  -3.724844 0.969046 0.512231
H  -2.91275 0.453348 2.023006
H  1.188033 2.556001 0.265856
H  2.053787 1.982889 -1.09301
H  1.040137 -2.892821 -0.364834
H  3.705814 -0.6380 0.280888
