program: Gaussian 09
title: 000182610
version: EM64L-G09RevD.01
frameworkgroup: C1[X(C11H14O4)]
method: RPBEPBE
basis: SDD
operation: Freq
keyword: #pfreq=noraman
keyword: PBEPBE/SDD
title: #p freq=noraman PBEPBE/SDD
converged: YES YES NO NO
title: Mulliken charges:
elementType: O O O O C C C C C C C C C C C H H H H H H H H H H H H H H
charge: -0.212139 -0.231486 -0.185295 -0.188274 -0.133515 -0.061241 -0.421433 -0.391608 0.192755 0.333974 -0.344672 0.105792 -0.360003 -0.634756 -0.695378 0.267576 0.236357 0.305725 0.237128 0.216096 0.228933 0.180006 0.205480 0.194177 0.252854 0.260059 0.208699 0.215324 0.218864
chargesum: 0.00000
title: Mulliken charges with hydrogens summed into heavy atoms:
elementType: O O O O C C C C C C C C C C C
charge: -0.212139 -0.231486 -0.185295 -0.188274 0.134062 0.175116 -0.115708 0.061617 0.192755 0.333974 0.064267 0.105792 0.039654 -0.121842 -0.052490
polarizability: 1.63863805e+02 -5.57506941e+00 1.19321639e+02 1.62698411e+01 9.35934325e-01 9.78641313e+01
1716.lowfreq: -4.7427 -0.0004 0.0004 0.0007 9.9943 14.8940 30.7934 56.5248 65.5502
frequency: 30.6423 56.4785 65.5087 70.9214 112.3520 116.6383 140.5957 144.9354 207.5966 224.5322 258.3273 281.9992 317.8208 381.1580 404.8494 432.2162 472.2303 539.8733 568.3577 586.9808 611.9720 650.9585 690.2693 728.6620 752.3334 767.4403 777.7016 788.7885 834.4693 863.1071 879.8990 897.5295 935.9134 947.5275 990.4963 999.1844 1014.0036 1024.7443 1039.3462 1067.0421 1080.7357 1086.3099 1119.1184 1156.2183 1202.5510 1210.7388 1215.0074 1246.6831 1255.2927 1264.7773 1276.5780 1293.7017 1297.3056 1309.2196 1322.2919 1353.0312 1368.0242 1391.1241 1421.0157 1449.4275 1469.7750 1476.6118 1477.9002 1488.8829 1670.8128 1700.3366 1701.9870 2962.5393 2970.3992 2974.6487 2990.2731 3001.1213 3011.6039 3038.7333 3054.8735 3065.4135 3070.7762 3073.5375 3075.1954 3108.1903 3221.5752
redmass: 4.7363 4.1219 2.8429 2.2456 6.6940 3.8697 2.5417 4.3258 4.3830 1.1917 3.2908 3.2431 6.2365 5.4472 3.3423 6.2225 3.8947 4.8971 4.6675 5.2518 2.6079 4.3853 4.9565 1.1675 2.7448 3.8064 1.8359 2.1403 3.7329 4.1914 2.4711 1.9277 1.5939 2.1074 1.6967 2.0646 3.2252 2.4581 3.4125 2.2169 2.2651 5.1235 2.4818 2.0876 1.3933 1.7824 1.4957 1.2837 2.0887 1.9661 1.2162 1.0726 1.3067 1.2895 1.2453 1.5053 1.6381 1.2199 1.1680 1.0841 1.0650 1.0433 1.0650 1.0864 6.6953 12.1371 12.5723 1.0621 1.0621 1.0363 1.0650 1.0851 1.0960 1.0974 1.0858 1.0984 1.0926 1.0983 1.0994 1.0622 1.1161
irintensity: 2.1730 1.2880 2.8793 2.3148 0.7235 0.3249 1.1328 4.6771 0.4585 0.1992 0.7745 1.2320 6.6784 0.4519 1.8019 2.8879 0.5625 10.9577 7.9778 3.4610 13.3407 0.6707 2.7789 9.8012 2.9614 12.4354 1.5422 4.3172 16.9233 26.6975 42.8039 14.4630 23.6426 61.7306 51.1383 37.0440 131.7195 17.1477 3.7363 22.0056 10.6292 311.5857 15.9506 7.2984 19.6609 27.4449 4.5699 1.7954 25.9391 67.5494 1.9217 2.1613 1.4008 1.7178 8.5280 6.4426 1.9751 12.8262 28.3672 5.9471 0.6921 12.4856 3.2106 19.1813 59.3459 273.0632 227.2244 6.2323 52.9132 38.4633 17.5467 20.8341 9.5462 10.1498 2.9329 0.3310 1.4797 133.1124 52.6208 0.7065 0.6912
temp: 298.150 k
press: 1.00000 atm
elementType: 8 8 8 8 6 6 6 6 6 6 6 6 6 6 6 1 1 1 1 1 1 1 1 1 1 1 1 1 1
symmnumber: 1
zpe: 607701.4 jmol-1
zpe.correction: 0.231461 hartree
zpe.thermalcorrener: 0.246101 hartree
zpe.thermalcorrenthalpy: 0.247046 hartree
zpe.thermalcorrgfe: 0.188500 hartree
zpe.sumelectzpe: -727.317910 hartree
zpe.sumelectthermal: -727.303270 hartree
zpe.sumelectthermalent: -727.302326 hartree
zpe.sumelectthermalfe: -727.360872 hartree
dipole: 0.6637 0.8382 4.4588
dipole: 4.5852
quadrupole: -80.1932 -108.9903 -84.7718
quadrupole: -7.2376 -3.8997 3.1123
quadrupole: 11.1252 -17.6718 6.5466 -7.2376 -3.8997 3.1123
hfenergy: -727.5493714 hartree
pointgroup: C01 [X(C11H14O4)]
dipole: 0.3050097 -0.2994507 -1.7525841 debye
polarizability: 164.4789532|6.2026864|119.3941668|-14.6278161|1.2785499|97.1764562 unknown
InChI: InChI=1S/C11H14O4/c1-3-4-5-7-9-8(11(13)14-7)6(2)10(12)15-9/h7-9H,2-5H2,1H3
charge 0 multiplicity 1
29 atoms
O  0.50406 -1.444689 -0.025596
O  -0.789043 1.543152 -0.554077
O  -1.355309 -2.657749 0.661733
O  -2.483795 2.42722 0.783614
C  -0.554742 0.304466 -1.346101
C  0.811989 -0.342551 -1.009704
C  -1.631259 -0.7147 -0.890089
C  1.881237 0.576681 -0.41823
C  -0.867859 -1.729567 0.002274
C  -2.623772 0.108615 -0.094933
C  3.222617 -0.147598 -0.169023
C  -2.041567 1.471329 0.129619
C  4.290499 0.788717 0.440117
C  -3.824187 -0.267586 0.407629
C  5.637003 0.074613 0.684833
H  -0.619724 0.590183 -2.407969
H  1.196375 -0.855146 -1.913494
H  -2.101835 -1.266211 -1.720333
H  1.496443 1.019277 0.518305
H  2.029472 1.420158 -1.122314
H  3.052759 -1.008105 0.506031
H  3.605309 -0.565341 -1.124351
H  3.909993 1.200838 1.396475
H  4.446513 1.656763 -0.23274
H  -4.221312 -1.277542 0.267337
H  -4.416332 0.446951 0.990782
H  6.057814 -0.316185 -0.260924
H  5.510998 -0.781037 1.374375
H  6.382352 0.759448 1.128657
