program: Gaussian 09
title: 000182589
version: EM64L-G09RevD.01
frameworkgroup: C1[X(C12H13N3O)]
method: RPBEPBE
basis: SDD
operation: Freq
keyword: #p
keyword: freq=noraman
keyword: PBEPBE/SDD
title: #p freq=noraman PBEPBE/SDD
converged: YES YES NO NO
title: Mulliken charges:
elementType: O N N N C C C C C C C C C C C C H H H H H H H H H H H H H
charge: -0.294604 -0.350787 -0.403958 -0.563204 -0.196763 0.434815 0.007986 -0.488695 -0.438321 0.240909 0.151956 -0.458252 0.056789 -0.367973 -0.396387 -0.212171 0.195483 0.214923 0.242971 0.222939 0.237640 0.270477 0.313415 0.307262 0.231639 0.273827 0.226260 0.277485 0.264340
chargesum: 0.00000
title: Mulliken charges with hydrogens summed into heavy atoms:
elementType: O N N N C C C C C C C C C C C C
charge: -0.294604 -0.037372 -0.096696 -0.021379 -0.001280 0.434815 0.007986 -0.030800 0.022257 0.240909 0.151956 -0.187775 0.056789 -0.136334 -0.122560 0.014089
polarizability: 1.93529048e+02 4.01140445e+00 1.78763054e+02 -1.11626803e+01 -6.62982612e+00 8.22961526e+01
1716.lowfreq: -9.2154 0.0007 0.0008 0.0010 3.6570 8.5016 48.0278 66.5321 110.0004
frequency: 48.0025 66.4905 109.9969 125.1004 212.3045 216.6595 229.5816 263.1503 277.3795 291.8573 315.9233 367.7679 391.4186 400.6714 441.4029 455.8753 495.4820 510.5364 550.0603 566.3461 597.2131 611.9273 634.9589 642.1125 694.1836 717.1992 732.6669 759.3224 799.2152 813.5302 817.9258 841.4635 907.0439 919.8291 925.0729 968.1819 982.5364 1029.1611 1056.8151 1075.1032 1100.0916 1106.1896 1118.0929 1141.6426 1168.6536 1209.0604 1213.6098 1253.7422 1275.1871 1282.0784 1306.6050 1323.6890 1332.8391 1349.7254 1360.3017 1376.7717 1396.8927 1408.1747 1418.8984 1446.8678 1458.6676 1473.1596 1491.8152 1558.8903 1572.2338 1589.7699 1629.3343 1630.4412 2959.9760 2984.1935 2993.7168 3050.9494 3064.3850 3131.0212 3150.6806 3168.8920 3218.9763 3499.7641 3517.0670 3613.5208 3633.9388
redmass: 4.5709 5.3326 2.4345 5.3189 2.8602 4.2676 3.6044 2.1896 1.6736 3.1661 1.8876 2.7224 6.8345 3.7030 2.9678 3.5975 4.7412 1.2022 4.3712 2.4893 4.5215 1.8804 3.2606 3.3099 3.0955 3.4298 5.5658 1.7625 1.6331 2.5865 3.4952 2.9864 1.8093 1.5789 2.2968 3.3011 1.3640 2.2423 2.1039 2.9595 3.1750 1.8009 1.9738 1.7396 1.6162 1.8456 1.4630 1.3855 1.7121 1.6367 1.7105 2.1980 1.2265 1.5436 1.5907 2.4283 2.5700 2.0381 2.0234 6.4086 1.0863 1.1726 2.9959 5.8514 5.6904 5.0551 5.9204 1.1303 1.0810 1.0661 1.0638 1.0997 1.1012 1.0873 1.0924 1.0970 1.0983 1.0442 1.0757 1.0810 1.1000
irintensity: 0.0631 2.7617 3.4022 3.3689 1.4885 13.1937 1.7677 11.9393 22.7983 6.6812 103.8789 114.0212 6.6426 131.9513 68.4783 5.7357 4.8280 129.8591 4.5519 2.6933 5.7084 75.3498 11.7683 1.9008 4.6869 1.8911 33.3838 88.7145 19.1157 7.7109 1.6298 6.9741 7.7894 5.1470 29.0471 15.1313 2.5068 6.0232 16.9802 11.8106 48.6927 21.1904 18.7250 13.1595 7.6838 7.8851 1.1421 0.5407 7.4449 11.8600 18.2305 153.3562 1.7683 3.9671 7.3717 26.5964 74.9490 43.0334 9.4948 0.8380 2.3945 39.1882 23.2961 25.7247 87.2158 145.4510 5.2960 41.3006 25.2889 76.3726 25.1350 29.5822 22.3181 4.9456 13.8168 16.6719 0.8887 2.2307 23.2538 67.0050 2.1665
temp: 298.150 k
press: 1.00000 atm
elementType: 8 7 7 7 6 6 6 6 6 6 6 6 6 6 6 6 1 1 1 1 1 1 1 1 1 1 1 1 1
symmnumber: 1
zpe: 615131.6 jmol-1
zpe.correction: 0.234291 hartree
zpe.thermalcorrener: 0.247744 hartree
zpe.thermalcorrenthalpy: 0.248688 hartree
zpe.thermalcorrgfe: 0.194698 hartree
zpe.sumelectzpe: -703.429086 hartree
zpe.sumelectthermal: -703.415634 hartree
zpe.sumelectthermalent: -703.414690 hartree
zpe.sumelectthermalfe: -703.468679 hartree
dipole: -0.4563 -5.8129 2.4829
dipole: 6.3374
quadrupole: -76.1098 -92.6909 -99.7464
quadrupole: -8.1388 -9.1455 1.5993
quadrupole: 13.4059 -3.1752 -10.2307 -8.1388 -9.1455 1.5993
hfenergy: -703.6633774 hartree
pointgroup: C01 [X(C12H13N3O1)]
dipole: -0.1940891 -2.3004164 0.9418742 debye
polarizability: 193.3333814|3.9664099|178.8604968|-12.5092012|-4.9774219|82.3943766 unknown
InChI: InChI=1S/C12H13N3O/c13-4-7-5-15-12(16)8-2-1-3-10-11(8)9(7)6-14-10/h1-3,6-7,14-15H,4-5,13H2
charge 0 multiplicity 1
29 atoms
O  -0.159029 3.247823 -0.243285
N  -1.571565 1.635882 0.58474
N  1.461948 -2.525533 0.014207
N  -4.077311 -0.43159 -0.806396
C  -1.884504 -0.890854 0.464315
C  -0.441867 -1.284459 0.266966
C  0.679102 -0.37603 0.099747
C  -1.976085 0.410759 1.303662
C  -2.654271 -0.768514 -0.90042
C  1.863325 -1.186904 -0.054579
C  0.812882 1.047209 0.052552
C  0.075988 -2.579269 0.210278
C  -0.316961 2.035994 0.126901
C  3.149515 -0.640084 -0.237762
C  2.105875 1.588714 -0.14073
C  3.253957 0.766131 -0.276318
H  -2.393849 -1.682421 1.055112
H  -3.026828 0.56348 1.609844
H  -1.376131 0.285598 2.226695
H  -2.541228 -1.729703 -1.437868
H  -2.157457 -0.00093 -1.520167
H  -0.441992 -3.532153 0.30648
H  -2.243396 2.408255 0.563541
H  2.080321 -3.329663 -0.061496
H  4.034743 -1.276065 -0.35001
H  2.189792 2.678355 -0.200602
H  4.234824 1.231838 -0.419176
H  -4.307772 0.550458 -0.653696
H  -4.674122 -1.086522 -0.298336
