program: Gaussian 09
title: 000182739
version: EM64L-G09RevD.01
frameworkgroup: C1[X(C15H23ClO10)]
method: RPBEPBE
basis: SDD
operation: Freq
keyword: #p
keyword: freq=noraman
keyword: PBEPBE/SDD
title: #p freq=noraman PBEPBE/SDD
converged: NO YES NO NO
title: Mulliken charges:
elementType: Cl O O O O O O O O O O C C C C C C C C C C C C C C C H H H H H H H H H H H H H H H H H H H H H H H
charge: -0.041966 -0.251021 -0.487425 -0.263098 -0.264245 -0.501259 -0.437728 -0.469070 -0.460418 -0.431244 -0.430282 -0.308399 0.253206 -0.132579 -0.519033 -0.464900 -0.073425 -0.365429 -0.233411 -0.080545 -0.091611 -0.179816 -0.159239 0.345767 -0.168305 -0.423544 0.322012 0.253571 0.223686 0.248147 0.226180 0.222848 0.261308 0.231209 0.229599 0.222438 0.251362 0.213522 0.385217 0.261052 0.219777 0.237786 0.401675 0.290439 0.364944 0.373919 0.388709 0.417617 0.392000
chargesum: 0.00000
title: Mulliken charges with hydrogens summed into heavy atoms:
elementType: Cl O O O O O O O O O O C C C C C C C C C C C C C C C
charge: -0.041966 -0.251021 -0.102208 -0.263098 -0.264245 -0.099584 -0.072784 -0.095151 -0.071709 -0.013627 -0.038282 0.013613 0.253206 0.120993 -0.047200 -0.015872 0.187883 0.095379 -0.010974 0.170817 0.121911 0.081236 0.078547 0.345767 0.051472 -0.133105
polarizability: 2.22300181e+02 -1.54806233e+01 1.99419465e+02 8.88379444e+00 4.31214463e+00 1.72030723e+02
1716.lowfreq: -7.3473 -0.0013 -0.0010 -0.0009 6.7750 11.4954 30.2593 43.8071 51.5234
frequency: 30.2098 43.2499 51.3792 74.3334 82.7060 85.5395 104.4203 118.8153 128.7455 151.6792 153.0316 172.8322 191.7050 205.1332 214.1231 235.8266 243.3282 250.0609 259.4082 292.7557 310.8672 320.4952 328.4318 333.8744 346.3044 350.1843 362.4538 382.4589 395.1637 401.5179 405.3612 419.1952 442.1277 445.1855 453.3902 475.9594 478.5961 501.2678 507.2318 525.3849 537.9089 571.4502 596.8164 619.2229 650.2561 662.6784 685.2467 691.7153 707.2045 723.3924 738.9243 745.2786 811.3575 819.2210 833.1661 842.9803 858.5896 880.7614 882.8044 902.8090 913.9997 916.8853 933.1740 950.2794 956.9741 967.8717 968.2453 990.2410 995.0662 1021.9215 1026.4514 1029.6618 1034.3522 1046.6754 1055.2620 1073.2003 1084.0676 1094.4613 1097.5823 1105.1787 1114.8036 1135.9662 1144.3432 1170.3237 1180.8412 1185.7300 1189.0811 1207.6239 1211.3606 1231.0593 1244.8212 1248.2251 1251.4230 1261.3873 1281.6244 1286.2704 1289.2301 1301.0853 1309.5618 1312.8029 1314.7699 1320.8429 1327.6397 1331.0967 1342.3204 1359.9720 1363.1338 1374.8256 1380.8442 1390.2920 1393.5416 1400.6702 1407.7718 1461.9629 1465.6532 1474.0065 1481.3562 1645.5766 2744.1831 2950.4131 2958.4554 2986.7062 2997.3199 3001.6784 3009.5846 3013.7275 3029.7585 3033.7556 3046.1967 3059.9843 3075.2641 3077.7916 3096.0642 3135.7381 3184.4002 3384.1850 3428.2478 3483.0776 3537.9593 3560.0845 3587.6528
redmass: 7.6010 6.1433 7.4752 7.2794 4.8216 6.3236 7.6601 6.4956 7.0391 5.4990 3.6150 6.0905 5.9131 5.4710 5.8046 5.1326 3.9016 4.4069 4.7905 3.3346 4.0243 3.8080 3.6833 1.6970 3.7593 5.3452 3.6559 4.4089 4.2982 4.5183 3.3374 1.2845 1.8335 2.4080 3.7004 5.1107 3.5235 1.4486 4.9029 3.4644 4.2440 1.2758 6.7488 2.2991 2.1846 4.5953 2.2143 2.8366 3.2563 5.5919 2.3734 2.4746 4.5522 3.6276 2.5084 3.7751 2.8666 4.6197 2.3113 4.1690 1.3045 2.2585 4.1814 1.6576 3.1812 2.7566 4.9388 3.4504 3.1751 3.6573 3.9567 1.8923 3.1844 2.1503 3.6753 3.8096 3.5353 2.1530 2.2371 1.9306 2.7700 2.5094 2.1493 1.3001 1.4769 1.2541 1.5289 1.3837 1.4063 1.1265 1.1968 1.1574 1.2663 1.5373 1.2046 1.2149 1.3749 1.2818 1.2974 1.3135 1.3226 1.3407 1.2399 1.2690 1.3307 1.4846 1.5336 1.4500 1.3032 1.5485 1.5087 1.5137 1.5522 1.0901 1.0851 1.0938 1.2427 6.9450 1.0807 1.0827 1.0820 1.0772 1.0844 1.0687 1.0632 1.0630 1.0855 1.0837 1.0881 1.1017 1.0881 1.1037 1.1045 1.0871 1.1002 1.0634 1.0670 1.0651 1.0654 1.0656 1.0662
irintensity: 2.1798 0.9892 2.2505 1.4146 0.3698 1.5127 3.0413 0.4315 1.0170 8.6949 1.5519 8.2329 7.2652 6.3876 5.2916 3.4348 4.3139 8.1574 6.9540 8.1077 4.0710 32.8922 4.4734 60.0268 33.4167 9.0110 2.5517 9.9496 45.4523 28.0159 30.0752 72.6302 108.6293 46.7404 12.1432 5.5554 11.8166 120.7183 18.6869 22.2387 66.1757 112.7997 51.1018 14.0326 70.7051 36.1429 73.8139 51.1321 19.6384 71.5036 68.5966 5.3956 127.9805 4.1306 18.3428 53.8131 32.3666 71.0832 9.8821 14.5548 10.0107 160.0378 302.5482 134.7871 91.2472 30.2231 19.2381 122.0730 50.3200 69.4591 106.7793 67.1707 82.0360 41.1265 86.0198 8.6583 17.0473 30.9338 40.3500 42.7260 73.3143 37.1181 86.2886 11.1232 18.0661 31.4781 22.3409 77.5959 35.1018 11.0355 73.6058 18.5627 13.9240 2.0985 23.5537 3.5376 15.1009 43.4151 17.6701 10.3595 20.8132 12.1351 62.2687 24.8300 28.7569 20.9687 2.0842 25.3359 16.4033 24.5556 56.1629 8.4169 55.6131 8.1482 13.1094 17.3833 188.7483 47.1734 1247.2359 4.9386 69.7351 8.3551 13.2798 57.2423 4.7752 50.6435 5.2637 32.2781 26.4400 23.8744 14.2210 32.3517 17.5794 5.5558 24.0640 72.2900 83.1829 93.8513 22.4880 30.8624 34.2189
temp: 298.150 k
press: 1.00000 atm
elementType: 17 8 8 8 8 8 8 8 8 8 8 6 6 6 6 6 6 6 6 6 6 6 6 6 6 6 1 1 1 1 1 1 1 1 1 1 1 1 1 1 1 1 1 1 1 1 1 1 1
symmnumber: 1
zpe: 1007699.1 jmol-1
zpe.correction: 0.383812 hartree
zpe.thermalcorrener: 0.408954 hartree
zpe.thermalcorrenthalpy: 0.409898 hartree
zpe.thermalcorrgfe: 0.330901 hartree
zpe.sumelectzpe: -1795.578057 hartree
zpe.sumelectthermal: -1795.552916 hartree
zpe.sumelectthermalent: -1795.551971 hartree
zpe.sumelectthermalfe: -1795.630968 hartree
dipole: -0.1095 3.2582 -0.9379
dipole: 3.3922
quadrupole: -131.0171 -165.7555 -160.6483
quadrupole: 1.1852 -1.8636 1.3781
quadrupole: 21.4565 -13.2819 -8.1746 1.1852 -1.8636 1.3781
hfenergy: -1795.9618692 hartree
pointgroup: C01 [X(C15H23Cl1O10)]
dipole: -0.0373154 -1.2108646 0.5599768 debye
polarizability: 222.0712466|13.9551467|200.0897214|-11.6276669|-0.141695|171.5894018 unknown
InChI: InChI=1S/C15H23ClO10/c16-13(21)15(23)10(20)8(18)9(19)12(26-15)25-11-7-6(2-4-24-11)1-3-14(7,22)5-17/h2,4,6-13,17-23H,1,3,5H2
charge 0 multiplicity 1
49 atoms
Cl 1.762043 -3.335847 1.429844
O  -0.218996 1.098101 0.511174
O  -2.413805 1.408664 -1.363586
O  -2.333974 1.425815 1.456793
O  1.582379 -0.127445 1.530749
O  -0.185582 0.248081 -2.256185
O  1.30211 3.479451 0.604642
O  3.532708 2.644168 -0.959938
O  3.681954 -0.114828 -1.645257
O  1.209157 -1.221316 -0.64105
O  3.827638 -2.433277 -0.151692
C  -1.918184 -0.643266 0.111667
C  -2.419798 -0.072037 -1.277903
C  -3.146118 -1.361874 0.75768
C  -3.847832 -0.66044 -1.475012
C  -3.954489 -1.843129 -0.483443
C  -1.319195 0.377293 1.084815
C  -1.470732 -0.455137 -2.436714
C  -3.952699 -0.405204 1.619012
C  0.958018 1.184804 1.37617
C  1.951905 2.190011 0.773868
C  2.528443 1.65709 -0.542159
C  -3.564386 0.867026 1.889423
C  2.160903 -0.749703 0.266505
C  3.180653 0.282372 -0.336311
C  2.934412 -1.950086 0.858196
H  -1.117161 -1.380631 -0.076911
H  -2.820173 -2.228393 1.36545
H  -4.037316 -0.955031 -2.523116
H  -4.575872 0.129184 -1.217442
H  -5.000431 -2.096729 -0.235554
H  -3.478922 -2.751089 -0.901949
H  -1.018131 -0.128431 2.024384
H  -1.915801 -0.138781 -3.398357
H  -1.250869 -1.53459 -2.461328
H  -4.917693 -0.746025 2.011634
H  0.660352 1.47351 2.40004
H  2.795626 2.270847 1.49479
H  -2.494868 1.809639 -0.453666
H  1.741369 1.580551 -1.316097
H  4.017414 0.394215 0.388158
H  -4.150413 1.598478 2.452001
H  -0.45584 1.147783 -1.90594
H  3.449499 -1.662697 1.78917
H  1.932261 4.049416 0.090433
H  3.979399 2.286524 -1.769961
H  3.93632 -1.075934 -1.587435
H  0.788222 -0.527183 -1.286726
H  4.342292 -3.212924 0.173131
