program: Gaussian 09
title: 000182611
version: EM64L-G09RevD.01
frameworkgroup: C1[X(C16H14N2O5S)]
method: RPBEPBE
basis: SDD
operation: Freq
keyword: #p
keyword: freq=noraman
keyword: PBEPBE/SDD
title: #p freq=noraman PBEPBE/SDD
converged: YES YES NO NO
title: Mulliken charges:
elementType: S O O O O O N N C C C C C C C C C C C C C C C C H H H H H H H H H H H H H H
charge: 0.198170 -0.163146 -0.402822 -0.218957 -0.197424 -0.188504 -0.094279 -0.254168 -0.448848 -0.142602 -0.172208 -0.112969 0.126626 -0.672184 -0.681242 0.176940 0.089620 0.137105 0.185065 0.178777 -0.350152 -0.346710 -0.210642 -0.208365 0.324688 0.286845 0.302970 0.241942 0.232789 0.234875 0.225951 0.299270 0.210669 0.388667 0.271010 0.271014 0.241182 0.241046
chargesum: 0.00000
title: Mulliken charges with hydrogens summed into heavy atoms:
elementType: S O O O O O N N C C C C C C C C C C C C C C C C
charge: 0.198170 -0.163146 -0.014155 -0.218957 -0.197424 -0.188504 -0.094279 -0.254168 -0.124160 0.144242 0.130762 -0.112969 0.126626 0.037422 0.054649 0.176940 0.089620 0.137105 0.185065 0.178777 -0.079142 -0.075696 0.030540 0.032681
polarizability: 2.93834598e+02 2.05192170e+00 2.03947926e+02 1.61255552e+01 1.89120858e+01 1.52564051e+02
1716.lowfreq: -13.5680 -7.7156 -3.1330 -0.0009 -0.0002 0.0006 26.1545 31.6762 49.7415
frequency: 26.0804 31.4194 49.7325 57.8409 78.7463 97.4758 103.3667 122.6474 140.1637 148.9197 174.7028 187.2846 213.8682 242.6600 246.7789 249.2091 262.5577 288.6059 300.3040 314.9973 331.7809 342.2346 372.7103 397.9482 412.2127 452.9520 455.8066 463.2603 496.9730 523.1616 524.1911 561.7688 571.6822 587.0766 610.6270 639.8933 656.5082 671.7166 681.7761 696.4360 717.2172 737.5013 780.1033 784.7626 797.0315 815.9177 841.6188 862.6672 889.8557 906.9933 909.2861 922.9805 949.1760 962.2450 976.0374 1007.9725 1008.0416 1008.6351 1036.0522 1066.2072 1074.5558 1080.7126 1085.7467 1120.9418 1147.7252 1171.0782 1172.7681 1174.4374 1189.0897 1198.6030 1222.3858 1238.8255 1256.7295 1278.6780 1284.8844 1315.1259 1328.7169 1353.8047 1370.2693 1386.9846 1408.3029 1417.6673 1454.4948 1454.8997 1456.2453 1469.4524 1472.3360 1489.4307 1615.4486 1618.9290 1636.0659 1661.1763 1683.2829 1740.2465 2977.7312 2986.2327 3035.0780 3062.3377 3075.3542 3083.9366 3097.4464 3102.5583 3112.6143 3141.5872 3155.0572 3166.6042 3176.2461 3508.0173
redmass: 7.0875 6.4298 7.4994 10.6759 5.5279 7.2932 8.1079 8.3613 5.8910 5.8592 10.0795 8.7461 4.1998 6.5908 1.8011 4.1986 1.7159 1.2951 3.9728 3.6202 4.6681 6.0995 4.1673 4.3958 3.3527 4.8843 5.1376 9.0727 4.9667 5.3556 5.3361 7.5616 2.7791 5.1956 1.7036 6.1901 4.8108 5.8491 4.8016 4.7589 3.4992 6.2533 5.9781 4.8574 1.7736 5.6418 5.9822 5.5066 4.7300 1.4153 4.3187 2.3426 1.6020 4.0590 1.4131 1.3503 1.6015 1.8538 2.7640 3.6974 2.6415 3.8832 2.1275 1.7559 1.5638 1.2302 1.9413 2.2313 1.6989 2.1195 2.9752 1.2924 1.6027 3.3763 1.5172 2.3202 1.6641 8.2369 1.5251 1.1888 1.1820 6.2594 1.0977 2.2494 2.7955 1.0474 1.0499 1.0480 7.7491 7.6649 12.3712 8.8247 12.4598 12.8640 1.0392 1.0361 1.0833 1.0857 1.0958 1.0986 1.1005 1.0895 1.0996 1.0866 1.0907 1.0957 1.1004 1.0641
irintensity: 0.6905 0.1850 2.1857 1.2774 1.8957 1.1725 2.2305 0.8142 0.2920 0.9342 2.5841 0.2844 2.6253 0.3446 1.6935 0.6328 1.1196 0.0668 3.4541 2.4157 24.2805 2.8304 4.0369 5.1379 5.4291 0.0647 9.9788 3.8555 17.4647 1.5235 14.7298 1.7096 77.1317 20.0070 85.4586 27.6447 0.2738 8.5318 27.3616 4.3097 77.5430 14.6142 3.0766 1.8066 28.3167 1.0257 13.4453 23.8859 19.9383 0.6655 26.4862 13.0903 3.2687 23.8874 1.8131 0.0141 6.1065 10.9472 14.7393 102.6830 60.5649 40.1802 99.6854 77.2523 20.5894 10.3571 5.9514 11.2406 2.1637 14.3734 76.6947 19.4517 12.8199 25.8940 0.5248 18.6907 46.2263 398.1891 34.6381 18.3451 19.8268 4.7730 13.6869 7.5433 0.2802 9.8286 8.8473 32.0250 3.5106 38.4308 400.7881 252.9500 72.0925 411.4936 29.3291 24.8651 10.0008 1.3727 7.5872 16.8988 17.4205 8.0520 5.3205 1.7002 5.0682 4.7033 20.8781 32.4021
temp: 298.150 k
press: 1.00000 atm
elementType: 16 8 8 8 8 8 7 7 6 6 6 6 6 6 6 6 6 6 6 6 6 6 6 6 1 1 1 1 1 1 1 1 1 1 1 1 1 1
symmnumber: 1
zpe: 726607.1 jmol-1
zpe.correction: 0.276750 hartree
zpe.thermalcorrener: 0.298133 hartree
zpe.thermalcorrenthalpy: 0.299077 hartree
zpe.thermalcorrgfe: 0.225944 hartree
zpe.sumelectzpe: -1500.085903 hartree
zpe.sumelectthermal: -1500.064520 hartree
zpe.sumelectthermalent: -1500.063576 hartree
zpe.sumelectthermalfe: -1500.136709 hartree
dipole: -2.7166 1.5539 -3.2489
dipole: 4.5111
quadrupole: -117.0181 -141.3340 -159.3164
quadrupole: -12.1215 -7.2006 2.1060
quadrupole: 22.2047 -2.1112 -20.0936 -12.1215 -7.2006 2.1060
hfenergy: -1500.3626531 hartree
pointgroup: C01 [X(C16H14N2O5S1)]
dipole: 1.0953307 -0.6112265 -1.2556096 debye
polarizability: 294.9902679|-0.3107037|205.0685768|-11.0870241|-16.5577848|150.2877301 unknown
InChI: InChI=1S/C16H14N2O5S/c1-16(2)10(15(22)23)18-13(21)9(14(18)24-16)17-11(19)7-5-3-4-6-8(7)12(17)20/h3-6,9-10,14,22H,1-2H3
charge 0 multiplicity 1
38 atoms
S  -1.369312 -0.495479 -1.770645
O  -1.078854 0.737733 2.611987
O  -4.283165 1.720094 -1.057866
O  -5.722931 0.337825 0.132294
O  2.340375 2.604484 -0.717466
O  0.655053 -1.453601 0.993874
N  -2.158371 0.841501 0.429388
N  1.163943 0.71763 0.135516
C  -1.297606 1.096672 -0.745733
C  -0.1086 1.388281 0.25865
C  -3.294324 -0.055436 0.280975
C  -2.853277 -1.233616 -0.711172
C  -1.112519 0.917114 1.386705
C  -3.960596 -1.662139 -1.692999
C  -2.326829 -2.427212 0.111054
C  -4.560775 0.661199 -0.188444
C  2.32935 1.406411 -0.346521
C  1.46667 -0.631234 0.513165
C  3.438884 0.409584 -0.2895
C  2.925205 -0.805066 0.225482
C  4.789311 0.542424 -0.646423
C  3.745207 -1.929211 0.402598
C  5.626734 -0.589806 -0.473346
C  5.112653 -1.806508 0.04357
H  -1.608152 1.937811 -1.379409
H  0.100024 2.472726 0.306177
H  -3.532826 -0.503129 1.261269
H  -4.282302 -0.827223 -2.338163
H  -3.592481 -2.47245 -2.345735
H  -4.838103 -2.043446 -1.137849
H  -1.891411 -3.190867 -0.556891
H  -1.538744 -2.120264 0.816805
H  -3.161457 -2.894521 0.669969
H  -5.13763 2.148527 -1.338198
H  5.17516 1.487346 -1.041134
H  3.338275 -2.861908 0.805177
H  6.686711 -0.525504 -0.740832
H  5.783812 -2.662946 0.167569
