program: Gaussian 09
title: 000182678
version: EM64L-G09RevD.01
frameworkgroup: C1[X(C23H20O6)]
method: RPBEPBE
basis: SDD
operation: Freq
keyword: #pfreq=noraman
keyword: PBEPBE/SDD
title: #p freq=noraman PBEPBE/SDD
converged: YES YES NO NO
title: Mulliken charges:
elementType: O O O O O O C C C C C C C C C C C C C C C C C C C C C C C H H H H H H H H H H H H H H H H H H H H
charge: -0.213695 -0.228028 -0.272642 -0.290388 -0.260972 -0.247471 -0.323734 -0.126338 0.333199 -0.110675 0.110135 0.209991 -0.717121 -0.734735 0.028981 -0.375990 0.240816 -0.392691 0.315974 0.088068 0.272383 -0.436721 -0.760043 0.319441 -0.381445 -0.370734 -0.240308 -0.248705 -0.237882 0.300060 0.283240 0.251637 0.218880 0.243494 0.248373 0.235981 0.219382 0.246763 0.261945 0.287018 0.260056 0.253972 0.254858 0.248701 0.241997 0.286051 0.231997 0.243890 0.233038
chargesum: 0.00000
title: Mulliken charges with hydrogens summed into heavy atoms:
elementType: O O O O O O C C C C C C C C C C C C C C C C C C C C C C C
charge: -0.213695 -0.228028 -0.272642 -0.290388 -0.260972 -0.247471 -0.023673 0.156902 0.333199 0.140962 0.110135 0.209991 -0.006374 -0.032610 0.028981 -0.114045 0.240816 -0.105673 0.315974 0.088068 0.272383 -0.176665 -0.002512 0.319441 -0.139449 -0.084682 -0.008311 -0.004816 -0.004845
polarizability: 3.37565552e+02 2.44487059e+01 3.43651106e+02 -8.26092589e+00 8.08620248e+00 1.51793810e+02
1716.lowfreq: -7.1213 -4.5155 -0.0005 -0.0004 0.0006 8.2289 18.4005 26.9925 38.7647
frequency: 18.1358 26.7773 38.7359 39.5347 51.6822 61.2048 69.1611 76.9085 94.5143 109.3053 124.1534 146.7349 165.5987 178.9320 183.8311 202.4329 225.5926 234.1433 258.4372 265.9146 287.3763 294.5551 314.2433 319.5616 334.3566 350.1143 377.1029 402.6332 419.1742 423.1395 457.6159 487.7016 497.8278 515.5460 527.5037 558.4418 568.6790 591.0328 597.2161 602.9493 613.5439 622.2473 627.1393 642.1203 663.3765 691.6764 701.3515 714.0792 735.1011 746.0185 762.6431 780.7626 783.4072 813.5843 834.0214 841.0306 858.3650 873.0054 875.2061 879.4335 882.3143 926.9045 938.7222 941.8404 951.5973 958.1981 975.3295 984.9282 985.1472 989.6693 998.0449 1004.8525 1008.0883 1017.9445 1031.1623 1041.9214 1044.2486 1053.7820 1088.5223 1121.9678 1127.3261 1168.5935 1173.5726 1189.3696 1191.1313 1195.9829 1200.6871 1205.1088 1238.0766 1248.6197 1249.3158 1257.7298 1278.8856 1281.6350 1286.5348 1315.4723 1321.0367 1333.7810 1337.0044 1379.6918 1383.8151 1385.7982 1394.7845 1397.4835 1436.1230 1445.0665 1452.1773 1454.2614 1455.6052 1463.0986 1469.4291 1473.9600 1479.2563 1485.0054 1551.2508 1580.0156 1587.1977 1611.1536 1613.6108 1633.5936 1643.4095 2995.4277 3001.8676 3006.2101 3050.7197 3081.2661 3091.6094 3097.5944 3099.7777 3107.8381 3109.8064 3121.1095 3130.4672 3140.8173 3142.1559 3153.2709 3155.4332 3166.0367 3182.5718 3183.1127 3183.6496
redmass: 3.3924 2.6259 4.3724 1.7973 4.1886 4.7547 6.3555 3.9233 4.0074 5.8183 5.4194 5.4268 4.9398 1.2309 2.0970 3.4086 1.6369 6.4959 3.1891 5.6123 5.2487 6.9430 5.9288 4.0297 4.1448 2.8595 5.3817 2.8575 5.4554 3.1163 4.3927 8.8806 4.4636 5.0956 4.1819 6.4201 3.6746 7.4942 5.7509 5.3596 6.3616 4.9473 5.4560 5.3263 6.5337 2.9749 1.9824 6.0908 6.0446 5.5572 4.5150 2.4006 3.7519 5.6434 5.8415 1.4298 1.2797 1.6286 3.0110 3.6723 5.5906 1.8686 1.4305 1.7318 5.7899 3.9037 2.7388 1.3613 1.8052 2.9313 1.7900 1.5229 1.3483 3.6915 2.3371 3.5681 1.8916 2.3040 1.6024 1.8074 1.8754 2.1093 1.0637 1.8815 1.5755 2.1207 2.0913 2.3913 1.8584 1.7155 1.6952 2.3091 3.0556 1.7858 1.9671 1.9450 1.2490 2.1488 1.5233 1.2307 8.2084 1.2376 4.0532 1.4240 2.3746 4.2215 1.0572 1.0539 1.0530 1.1916 2.7850 1.0987 2.3408 1.0631 10.3086 6.6646 7.4432 6.2670 8.1500 9.0548 9.4985 1.0363 1.0365 1.0387 1.0855 1.0869 1.0989 1.0990 1.0938 1.0998 1.0904 1.1001 1.0853 1.0891 1.1024 1.0941 1.0896 1.0987 1.0935 1.0947 1.0960
irintensity: 1.0671 0.7445 1.7966 0.3709 0.2554 0.2751 0.1132 4.2634 2.5959 1.7914 1.3216 0.8277 4.7257 0.1256 0.8442 3.7672 0.5647 1.8613 0.5333 0.9985 0.1955 4.7182 2.2833 4.8003 4.5293 2.0415 5.0713 0.1343 3.2601 4.9381 3.6430 3.0946 10.6325 7.3799 9.7157 1.7863 6.2387 20.8855 0.7900 5.3641 0.3281 8.5326 1.4440 9.9459 44.0316 8.0047 38.1807 12.3327 12.6417 6.7404 3.8147 84.5483 40.0063 83.4957 8.9913 57.8201 1.8431 13.1629 60.8282 9.7714 42.3998 3.0468 2.9444 23.6091 13.6791 46.7305 21.6125 1.0064 1.8750 2.3244 46.6258 23.0695 2.2610 155.6997 78.2229 36.9242 38.3948 7.2643 18.0598 25.2361 46.3414 7.9750 2.4711 21.0914 77.9566 4.0731 209.7939 28.7612 32.1940 7.1208 4.0607 0.8472 26.1990 12.5575 35.1380 113.6366 10.9860 229.6909 60.9981 15.7061 13.3523 68.1434 70.6364 24.9223 51.5485 10.7529 24.1444 8.1341 14.8154 7.1547 4.6307 3.2081 10.1366 21.9931 175.5160 49.7523 3.2697 27.2822 255.5011 199.0470 184.9673 9.5630 17.3675 1.0514 1.7537 9.7879 5.2887 21.3906 7.7498 18.4632 23.3900 15.4523 0.3461 6.8380 5.5065 24.6755 0.8439 25.9025 0.3110 11.9360 1.6839
temp: 298.150 k
press: 1.00000 atm
elementType: 8 8 8 8 8 8 6 6 6 6 6 6 6 6 6 6 6 6 6 6 6 6 6 6 6 6 6 6 6 1 1 1 1 1 1 1 1 1 1 1 1 1 1 1 1 1 1 1 1
symmnumber: 1
zpe: 987386.9 jmol-1
zpe.correction: 0.376076 hartree
zpe.thermalcorrener: 0.401465 hartree
zpe.thermalcorrenthalpy: 0.402409 hartree
zpe.thermalcorrgfe: 0.319186 hartree
zpe.sumelectzpe: -1337.748117 hartree
zpe.sumelectthermal: -1337.722728 hartree
zpe.sumelectthermalent: -1337.721783 hartree
zpe.sumelectthermalfe: -1337.805007 hartree
dipole: 0.4844 -6.2554 -1.4430
dipole: 6.4380
quadrupole: -165.3925 -172.9711 -166.3965
quadrupole: 9.5815 6.2118 2.1752
quadrupole: 2.8609 -4.7177 1.8568 9.5815 6.2118 2.1752
hfenergy: -1338.1241927 hartree
pointgroup: C01 [X(C23H20O6)]
dipole: -0.0474134 2.4682163 0.5667445 debye
polarizability: 343.0601824|-24.1537261|338.4653249|-0.5024145|9.6595722|151.4849603 unknown
InChI: InChI=1S/C23H20O6/c1-12(24)26-21-19-18-16(28-22(19)29-23(21,2)3)10-9-14-15(25)11-17(27-20(14)18)13-7-5-4-6-8-13/h4-11,19,21-22H,1-3H3
charge 0 multiplicity 1
49 atoms
O  4.079567 0.878754 -0.062246
O  3.683022 -1.42162 0.67631
O  1.632366 2.680602 0.485967
O  -0.971882 -0.623554 0.241599
O  -0.214446 3.321825 -0.793949
O  -1.805842 -4.652934 -0.555213
C  1.894072 0.284977 0.820346
C  1.741504 1.391628 -0.256685
C  3.063049 1.35763 -1.080021
C  3.446569 0.066386 0.922629
C  1.375098 -1.08876 0.448439
C  2.44556 -2.006832 0.401006
C  2.970072 0.352022 -2.246724
C  3.563893 2.725407 -1.554866
C  0.077104 -1.562779 0.199647
C  2.269821 -3.380794 0.117825
C  -0.153132 -2.940528 -0.07578
C  0.957971 -3.827701 -0.112826
C  0.607652 3.563571 0.119541
C  -1.535791 -3.428314 -0.312457
C  -2.293767 -1.062763 0.005536
C  -2.567168 -2.387026 -0.257347
C  0.627932 4.78989 1.002197
C  -3.270148 0.04458 0.054754
C  -4.636938 -0.217448 0.351319
C  -2.864122 1.38044 -0.213129
C  -5.575934 0.832912 0.369936
C  -3.808921 2.427571 -0.194666
C  -5.166917 2.16022 0.095408
H  1.460323 0.648471 1.766441
H  0.847064 1.274545 -0.889503
H  3.929492 0.260953 1.890343
H  2.33665 0.763698 -3.053209
H  3.980626 0.173462 -2.650877
H  2.547555 -0.618155 -1.938085
H  4.509826 2.599284 -2.108322
H  2.825614 3.194025 -2.229729
H  3.743286 3.392327 -0.697727
H  3.127676 -4.056738 0.089717
H  0.744216 -4.879562 -0.329348
H  -3.593616 -2.692385 -0.473107
H  1.659823 5.069192 1.265772
H  0.087176 4.572277 1.941667
H  0.119093 5.622127 0.493752
H  -4.959568 -1.236384 0.590736
H  -1.822079 1.602588 -0.456413
H  -6.623998 0.61914 0.605952
H  -3.478485 3.447521 -0.417832
H  -5.899321 2.974948 0.109319
