program: Gaussian 09
title: 000182581
version: EM64L-G09RevD.01
frameworkgroup: C1[X(C15H20N2O)]
method: RPBEPBE
basis: SDD
operation: Freq
keyword: #p
keyword: freq=noraman
keyword: PBEPBE/SDD
title: #p freq=noraman PBEPBE/SDD
converged: YES YES NO NO
title: Mulliken charges:
elementType: O N N C C C C C C C C C C C C C C C H H H H H H H H H H H H H H H H H H H H
charge: -0.445565 -0.277038 -0.402757 0.035587 -0.411816 -0.415936 -0.441322 -0.434591 -0.433932 -0.574015 0.412673 0.156947 -0.454002 0.213526 -0.601805 -0.319642 0.278054 -0.351340 0.183720 0.201460 0.196068 0.190036 0.209203 0.212314 0.207804 0.171618 0.211432 0.212113 0.172594 0.203328 0.215170 0.262132 0.267234 0.301668 0.226390 0.227488 0.246932 0.348271
chargesum: 0.00000
title: Mulliken charges with hydrogens summed into heavy atoms:
elementType: O N N C C C C C C C C C C C C C C C
charge: -0.097295 -0.014906 -0.101089 0.219307 -0.014287 -0.016697 -0.021205 -0.051541 -0.049225 -0.155517 0.412673 0.156947 -0.186767 0.213526 -0.375415 -0.092154 0.278054 -0.104407
polarizability: 2.18615916e+02 -5.03907940e+00 1.97295075e+02 -1.24980363e+01 2.46808084e-01 1.16283343e+02
1716.lowfreq: -23.7212 -0.0007 -0.0005 -0.0004 2.4779 8.3817 11.2815 22.6923 47.7057
frequency: -18.5646 22.2135 47.4428 81.4574 121.1815 145.8196 168.8592 186.4025 205.1507 235.0757 281.7466 315.1246 324.1374 339.3219 355.0241 392.0249 412.2760 421.7817 443.0905 450.1280 458.8282 479.5156 494.0809 534.7699 582.5025 596.0838 645.4891 680.8871 700.7862 738.0071 749.4200 766.9828 790.9730 803.3669 804.3798 807.3074 824.8308 833.2715 879.2975 904.2706 922.2169 930.0115 964.1683 973.4037 986.4116 1021.6872 1043.5855 1062.7208 1085.0580 1092.5961 1102.6894 1111.2491 1119.8741 1142.4634 1144.9021 1158.4746 1175.2256 1201.8024 1210.9912 1236.9940 1242.6185 1252.2129 1261.2830 1274.7260 1280.8845 1296.2380 1307.6764 1311.1963 1319.6473 1336.1537 1339.0605 1347.1271 1349.6144 1384.6937 1395.2316 1440.0031 1440.7254 1447.3499 1451.7735 1460.6136 1463.8495 1464.8518 1471.8279 1476.2476 1480.8997 1563.8797 1601.8622 1636.5946 2829.0041 2836.7357 2923.8640 2963.9304 2970.6598 2973.5270 2976.5401 3008.2905 3025.7338 3029.8031 3034.4575 3037.9654 3043.1446 3113.8137 3136.4666 3174.2056 3217.8596 3453.5851 3584.8981 3618.6803
redmass: 2.9985 5.1088 4.0492 3.2950 3.3163 5.0607 2.9085 3.3886 3.2375 1.7722 4.2628 1.9295 1.1612 3.6209 3.9123 3.7459 2.8497 2.7208 5.4780 3.0182 2.2594 1.2891 3.7240 1.7202 3.1318 3.3128 3.6019 1.8316 4.1118 1.9834 2.7223 2.7705 1.5621 1.5549 1.4940 2.8963 2.4987 1.9386 2.5393 2.0743 4.0678 1.3281 1.5049 1.8418 1.9469 3.3901 2.4602 1.7834 1.9206 1.9175 1.5886 2.2895 1.5100 1.3655 1.3301 1.7861 2.1790 1.2083 1.6830 1.6344 1.7852 1.5181 1.3339 1.2592 1.2902 1.4956 1.2261 1.6899 1.3484 1.5598 1.6876 1.5004 1.6866 1.4249 4.4359 1.2269 2.6074 1.2458 1.0938 1.2515 1.0881 2.7081 1.1014 1.1037 4.2492 6.1022 6.2265 7.2501 1.0721 1.0699 1.0816 1.0594 1.0594 1.0595 1.0598 1.0996 1.0873 1.0892 1.1030 1.1027 1.1023 1.0916 1.0896 1.0954 1.0981 1.0752 1.0659 1.0809
irintensity: 0.0909 0.0283 0.2132 0.3571 0.0741 3.8227 0.8100 0.7984 0.7560 0.5107 0.4281 1.7715 113.0662 19.0850 14.4189 3.4318 7.6089 17.6285 2.4707 0.2533 24.8163 113.1322 4.7653 39.4622 13.9566 19.8025 11.7912 62.4069 19.3045 0.1057 1.1062 5.5483 47.4681 14.9294 1.2509 5.3902 18.7005 24.1726 2.5254 2.5698 24.2132 0.1192 3.4192 5.4497 2.8275 6.0278 14.8362 3.4142 2.8401 29.1015 36.3280 8.4417 84.1372 12.8977 137.5649 2.3030 9.2772 5.9234 6.4964 4.9851 8.6213 19.0845 5.0876 0.6336 2.1413 3.8454 4.1346 3.8506 22.0724 5.6551 19.0429 2.4277 4.4016 2.8620 20.5685 5.9501 12.7739 0.3437 10.8225 6.3575 0.8937 38.8286 10.2353 12.0719 69.9991 0.8629 20.6501 28.7393 54.2384 180.3130 27.6463 3.8447 24.4422 40.9989 73.1008 1.2927 84.1976 34.0680 2.0533 36.2406 119.5624 17.5754 11.8235 9.1326 1.5600 3.3061 26.4172 62.8034
temp: 298.150 k
press: 1.00000 atm
elementType: 8 7 7 6 6 6 6 6 6 6 6 6 6 6 6 6 6 6 1 1 1 1 1 1 1 1 1 1 1 1 1 1 1 1 1 1 1 1
symmnumber: 1
zpe: 847924.1 jmol-1
zpe.correction: 0.322957 hartree
zpe.thermalcorrener: 0.338562 hartree
zpe.thermalcorrenthalpy: 0.339506 hartree
zpe.thermalcorrgfe: 0.279718 hartree
zpe.sumelectzpe: -766.973870 hartree
zpe.sumelectthermal: -766.958265 hartree
zpe.sumelectthermalent: -766.957321 hartree
zpe.sumelectthermalfe: -767.017109 hartree
dipole: 1.5358 -3.0356 -0.5956
dipole: 3.4538
quadrupole: -97.7154 -99.4513 -112.1503
quadrupole: 13.4546 -4.3086 -3.5541
quadrupole: 5.3903 3.6544 -9.0446 13.4546 -4.3086 -3.5541
hfenergy: -767.2968272 hartree
pointgroup: C01 [X(C15H20N2O1)]
dipole: 0.6320985 1.1545279 0.3374861 debye
polarizability: 218.477173|3.3295659|196.5278573|14.3189076|6.4167188|117.1893043 unknown
InChI: InChI=1S/C15H20N2O/c18-13-3-4-15-14(9-13)12(10-17-15)2-1-11-5-7-16-8-6-11/h3-4,9-11,16-18H,1-2,5-8H2
charge 0 multiplicity 1
38 atoms
O  -3.027538 -3.201399 -0.401683
N  5.305546 -1.195078 -0.138334
N  -2.925284 2.361626 0.106285
C  2.898726 0.475537 0.020693
C  3.085574 -0.806273 0.876135
C  3.753485 0.360197 -1.268611
C  1.414206 0.754183 -0.32297
C  4.578787 -1.090178 1.145139
C  5.228983 0.044239 -0.943376
C  0.530578 1.117713 0.904546
C  -0.91986 1.344553 0.552473
C  -1.893151 0.324689 0.196434
C  -1.590665 2.567679 0.486655
C  -3.140057 0.988746 -0.078002
C  -1.82574 -1.092388 0.095075
C  -4.303256 0.278041 -0.448825
C  -2.990202 -1.792876 -0.274049
C  -4.218386 -1.122395 -0.546496
H  3.287566 1.337553 0.610336
H  2.654394 -1.669514 0.33014
H  2.555133 -0.716023 1.843474
H  3.693628 1.302195 -1.849104
H  3.348525 -0.452775 -1.903304
H  0.986809 -0.131292 -0.835973
H  1.356487 1.588741 -1.050893
H  4.981104 -0.27215 1.799303
H  4.69205 -2.042179 1.696637
H  5.803148 -0.102522 -1.87714
H  5.670738 0.92708 -0.410327
H  0.948163 2.024914 1.384498
H  0.601236 0.306862 1.657104
H  6.270043 -1.529477 -0.019809
H  -1.212458 3.569059 0.686471
H  -3.626818 3.089037 -0.005943
H  -0.889143 -1.625639 0.303912
H  -5.250017 0.788731 -0.656278
H  -5.085861 -1.725326 -0.829779
H  -2.139872 -3.588892 -0.201812
