program: Gaussian 09
title: 000182582
version: EM64L-G09RevD.01
frameworkgroup: C1[X(C17H18BrN)]
method: RPBEPBE
basis: SDD
operation: Freq
keyword: #p
keyword: freq=noraman
keyword: PBEPBE/SDD
title: #p freq=noraman PBEPBE/SDD
converged: YES YES NO NO
title: Mulliken charges:
elementType: Br N C C C C C C C C C C C C C C C C C H H H H H H H H H H H H H H H H H H
charge: -0.000081 -0.097553 -0.206667 -0.342796 -0.542323 0.276787 0.239842 0.527152 -0.418184 -0.416818 -0.635940 -0.616411 -0.246012 -0.238879 -0.456235 -0.385715 -0.181814 -0.191141 -0.227693 0.229316 0.238474 0.234152 0.232495 0.238948 0.253531 0.225678 0.218693 0.212507 0.187415 0.224415 0.222349 0.225386 0.226450 0.238219 0.255702 0.248685 0.248065
chargesum: 0.00000
title: Mulliken charges with hydrogens summed into heavy atoms:
elementType: Br N C C C C C C C C C C C C C C C C C
charge: -0.000081 -0.097553 0.022649 -0.104322 -0.075675 0.276787 0.239842 0.527152 -0.179236 -0.163287 0.020938 0.017767 -0.020626 -0.012429 -0.218016 -0.130013 0.066871 0.056924 -0.227693
polarizability: 2.90267179e+02 6.86136308e-01 1.68060689e+02 6.49420425e+00 -1.27673741e+01 1.52981318e+02
1716.lowfreq: -4.3876 -0.0006 0.0002 0.0003 4.7954 10.0841 27.1296 31.6627 46.2992
frequency: 27.1179 31.5649 46.2860 75.5410 79.1861 112.1862 142.9053 159.7746 176.7062 200.9631 212.2219 224.9175 269.0617 284.7097 305.5853 321.2558 342.0198 391.2832 407.8391 423.7271 462.8104 469.9327 489.1104 532.4290 554.7317 612.2272 622.9007 634.9578 652.2486 720.1945 727.1589 736.3178 769.2117 805.6389 829.0562 835.2918 848.9512 872.5407 882.7269 942.7789 952.4490 970.0404 974.5235 987.9170 991.2666 996.4759 1018.6030 1034.3148 1041.7655 1056.2117 1060.8936 1080.9753 1087.9242 1106.8471 1135.0094 1142.4597 1161.4483 1170.0148 1185.6735 1190.4166 1198.3464 1220.5865 1251.2135 1258.2803 1263.6239 1283.0001 1284.2029 1293.0183 1313.2349 1356.3169 1375.8242 1384.5109 1397.2955 1420.9493 1439.9123 1443.2484 1454.9364 1462.6737 1467.2117 1471.3761 1475.2129 1482.1718 1496.4838 1579.3697 1592.3166 1596.9368 1610.4700 2861.1839 2887.0914 2955.1472 2964.4960 3003.9148 3015.2737 3019.4109 3067.6583 3076.1648 3089.0803 3120.4496 3123.4599 3129.3568 3133.2037 3142.6936 3159.4399 3165.2333 3168.4515
redmass: 5.2956 3.9791 4.3446 3.1117 3.3908 4.3705 3.9440 5.1556 4.0257 1.4364 1.1498 2.1671 3.9792 4.3271 3.7655 3.7348 3.4536 3.8656 2.8856 3.2460 3.3368 3.7047 3.9023 3.6387 2.9471 4.1009 4.0986 5.2407 4.8213 3.5958 4.5770 2.7992 1.4236 3.2261 1.5391 1.3243 3.8567 3.5389 1.4862 1.4362 1.3915 1.6120 1.5951 1.3329 2.6896 4.1918 2.7646 2.4151 1.6033 2.8320 2.5144 1.8643 1.3869 1.4137 1.4156 1.4690 1.9384 1.1018 1.1093 2.1125 2.6477 1.6008 1.3955 1.4614 1.4075 2.3176 1.5947 1.3891 1.8011 1.4886 5.8330 7.4578 2.3844 1.1339 1.4886 1.6066 1.0956 1.7403 1.1614 1.7586 1.4335 1.0659 1.0686 7.1610 7.1102 6.2989 6.8470 1.0561 1.0548 1.0827 1.0835 1.0737 1.0755 1.0626 1.0995 1.0987 1.1025 1.0850 1.0899 1.0893 1.0892 1.0943 1.1002 1.0950 1.0959
irintensity: 0.0079 0.0615 0.0203 0.2319 0.4588 0.3820 0.2961 0.0900 0.4445 1.2861 0.8964 4.4307 0.7578 9.1540 2.6045 1.8480 3.3786 4.6934 0.2703 11.2162 5.0611 7.6003 0.3613 14.3873 18.4976 2.7080 1.6793 1.1468 5.7092 3.8615 1.6727 24.9710 54.5364 7.4680 36.0541 10.8738 12.2738 12.5248 0.1438 1.0819 0.1194 0.6173 1.5994 0.1559 10.7313 55.6560 8.3138 4.1761 27.8344 54.0061 18.1524 14.7873 12.1133 10.2392 1.8581 11.4808 4.5161 0.9860 0.5122 9.2575 2.9977 3.0466 5.1185 1.6681 0.7970 15.2099 1.1790 8.0846 2.9662 18.4553 0.1891 2.7586 9.9195 5.8798 2.7538 12.6123 7.7874 7.4606 1.9397 59.5808 78.9657 17.0922 13.5169 0.3313 1.1996 3.4846 3.8969 117.3664 105.7029 20.7657 21.3163 66.8692 27.7686 44.6962 26.9135 47.5082 32.8936 2.1905 11.2028 7.9095 8.8649 35.1895 31.9739 9.8829 0.9399
temp: 298.150 k
press: 1.00000 atm
elementType: 35 7 6 6 6 6 6 6 6 6 6 6 6 6 6 6 6 6 6 1 1 1 1 1 1 1 1 1 1 1 1 1 1 1 1 1 1
symmnumber: 1
zpe: 792739.7 jmol-1
zpe.correction: 0.301939 hartree
zpe.thermalcorrener: 0.319477 hartree
zpe.thermalcorrenthalpy: 0.320421 hartree
zpe.thermalcorrgfe: 0.254524 hartree
zpe.sumelectzpe: -725.439038 hartree
zpe.sumelectthermal: -725.421499 hartree
zpe.sumelectthermalent: -725.420555 hartree
zpe.sumelectthermalfe: -725.486453 hartree
dipole: -3.0430 0.1504 0.4772
dipole: 3.0839
quadrupole: -122.7976 -123.5121 -115.1948
quadrupole: 1.4718 4.1816 -2.3138
quadrupole: -2.2961 -3.0106 5.3066 1.4718 4.1816 -2.3138
hfenergy: -725.7409761 hartree
pointgroup: C01 [X(C17H18Br1N1)]
dipole: 1.119976 -0.3918963 -0.2533079 debye
polarizability: 269.3624478|-47.3911602|184.3791629|3.5896232|14.4405144|157.5675752 unknown
InChI: InChI=1S/C17H18BrN/c1-19(2)17-11-16(12-7-9-13(18)10-8-12)14-5-3-4-6-15(14)17/h3-10,16-17H,11H2,1-2H3
charge 0 multiplicity 1
37 atoms
Br -5.853188 2.19457 0.911463
N  1.719712 -2.970713 -0.16529
C  1.457141 -1.685862 -0.852951
C  -0.20936 0.170538 -1.092479
C  -0.069692 -1.388761 -1.008119
C  1.987897 -0.386284 -0.217802
C  1.027728 0.650385 -0.325321
C  -1.55412 0.693293 -0.604198
C  3.23559 -0.137382 0.393528
C  1.297438 1.939565 0.177231
C  1.457898 -3.010226 1.283719
C  2.961902 -3.664406 -0.545979
C  3.50777 1.153609 0.908561
C  2.543601 2.185871 0.802665
C  -2.547063 1.10821 -1.525687
C  -1.865041 0.736139 0.780094
C  -3.818484 1.550135 -1.09286
C  -3.127043 1.175167 1.235656
C  -4.091975 1.576729 0.288627
H  1.901568 -1.78726 -1.865175
H  -0.093872 0.473709 -2.1549
H  -0.605053 -1.753151 -0.11257
H  -0.500984 -1.903096 -1.88257
H  3.991313 -0.926777 0.470104
H  0.551473 2.73848 0.092659
H  0.478136 -2.555912 1.511461
H  1.424083 -4.064038 1.617544
H  2.22568 -2.479776 1.896932
H  3.892241 -3.227189 -0.104921
H  2.909253 -4.720071 -0.218331
H  3.071909 -3.657652 -1.645244
H  4.470498 1.356864 1.391538
H  2.765876 3.18104 1.204336
H  -2.330076 1.087566 -2.600716
H  -1.108457 0.434052 1.513549
H  -4.574676 1.867385 -1.816667
H  -3.353225 1.205852 2.305513
