program: Gaussian 09
title: 000189443
version: EM64L-G09RevD.01
frameworkgroup: C1[X(C13H7Cl5O2S)]
method: RPBEPBE
basis: SDD
operation: Freq
keyword: #p
keyword: freq=noraman
keyword: PBEPBE/SDD
title: #p freq=noraman PBEPBE/SDD
converged: YES YES NO NO
title: Mulliken charges:
elementType: Cl Cl Cl Cl Cl S O O C C C C C C C C C C C C C H H H H H H H
charge: 0.029341 0.052407 0.028913 -0.027821 -0.034395 0.920749 -0.516255 -0.544099 -0.046667 0.557165 -0.340742 0.398968 -0.238944 -0.311606 -0.093956 -0.727108 -0.303255 -0.296986 -0.102819 -0.189526 -0.212400 0.339002 0.278648 0.297405 0.271978 0.279601 0.265560 0.266842
chargesum: 0.00000
title: Mulliken charges with hydrogens summed into heavy atoms:
elementType: Cl Cl Cl Cl Cl S O O C C C C C C C C C C C C C
charge: 0.029341 0.052407 0.028913 -0.027821 -0.034395 0.920749 -0.516255 -0.544099 -0.046667 0.557165 -0.340742 0.398968 0.100058 -0.311606 -0.093956 0.120922 -0.303255 -0.017385 -0.102819 0.076034 0.054442
polarizability: 2.76629348e+02 7.57203249e+00 2.20679363e+02 1.20089326e+01 -2.70239212e-01 1.75726203e+02
1716.lowfreq: -2.9186 -0.0026 -0.0024 -0.0019 2.1207 5.0866 12.9587 32.9710 48.1801
frequency: 12.9451 32.9705 48.1755 52.4232 56.9503 90.4513 92.8459 110.3571 117.1211 142.8106 148.5655 167.3614 196.2970 198.6225 206.9412 214.2146 234.7080 263.3377 285.6314 290.7003 308.1298 312.3157 313.3475 317.8931 369.3979 379.9473 403.3548 440.9799 478.7226 503.0395 511.8561 544.8281 575.7728 601.2265 616.5224 624.9667 636.7931 703.2991 729.2690 777.1183 786.8734 799.4176 817.1327 833.0730 888.2225 895.6544 928.7739 951.9492 978.9452 996.5893 1016.5377 1038.1516 1081.6030 1106.3203 1135.4335 1147.2781 1218.9658 1250.4843 1305.1864 1336.6980 1348.0951 1358.8834 1368.1519 1401.8757 1409.7829 1421.6626 1459.1194 1538.9762 1562.0393 1568.6224 1599.6395 3031.5494 3130.7166 3166.7785 3170.7050 3180.0337 3185.1179 3189.5491
redmass: 16.9279 13.6542 9.3825 7.0336 14.9361 9.0423 20.9782 10.2607 5.4816 1.8304 2.4055 7.8735 8.5908 20.8013 9.0670 6.9729 8.9784 5.4277 7.5466 12.1695 8.0072 25.1628 12.6431 12.6137 9.4501 9.9267 5.4549 3.4961 10.9869 5.4443 8.4310 7.9665 7.9939 5.9569 9.3494 7.8310 7.6197 7.8696 4.6465 8.7692 10.1527 11.6392 1.3523 8.6791 1.4587 3.1498 1.3631 1.3460 1.4336 5.6117 1.8698 7.5432 2.0505 5.5838 1.4621 1.5826 3.9292 1.3623 1.1374 6.5984 4.1624 8.6290 3.9537 3.9189 1.0630 1.0535 3.4877 8.1419 6.9335 10.9200 8.5042 1.0245 1.0920 1.0890 1.0933 1.1071 1.0979 1.1083
irintensity: 0.0779 1.1619 0.0522 3.0475 1.7427 0.8769 0.1504 0.6544 5.9847 0.8150 0.5098 0.5525 0.5581 0.8987 1.4185 0.7474 1.0101 1.3304 0.6988 1.0503 0.5665 0.7502 11.9950 4.5908 5.9879 88.2574 4.3375 11.2717 10.3278 1.4977 31.0907 41.9306 18.2172 1.6357 7.6345 10.1762 9.2377 9.1280 5.9854 5.9098 38.4321 75.0563 40.7991 12.3444 7.4179 27.3362 14.8116 0.0003 87.0118 73.6752 43.1124 34.1491 34.9862 44.7740 1.9253 17.3409 28.3257 6.9222 6.7405 43.9578 25.4860 2.4475 90.0104 94.7709 6.6720 13.7927 37.5699 9.4445 9.6566 7.5871 5.1309 0.3139 40.1834 0.1894 0.1019 0.0548 0.8563 0.6409
temp: 298.150 k
press: 1.00000 atm
elementType: 17 17 17 17 17 16 8 8 6 6 6 6 6 6 6 6 6 6 6 6 6 1 1 1 1 1 1 1
symmnumber: 1
zpe: 428961.7 jmol-1
zpe.correction: 0.163383 hartree
zpe.thermalcorrener: 0.185058 hartree
zpe.thermalcorrenthalpy: 0.186002 hartree
zpe.thermalcorrgfe: 0.109784 hartree
zpe.sumelectzpe: -3346.714258 hartree
zpe.sumelectthermal: -3346.692583 hartree
zpe.sumelectthermalent: -3346.691639 hartree
zpe.sumelectthermalfe: -3346.767857 hartree
dipole: -2.8935 -0.3463 4.4980
dipole: 5.3595
quadrupole: -168.5415 -167.6148 -164.8291
quadrupole: 1.7735 9.8745 -12.2449
quadrupole: -1.5463 -0.6197 2.1660 1.7735 9.8745 -12.2449
hfenergy: -3346.8776411 hartree
pointgroup: C01[X(C13H7Cl5O2S1)]
dipole: -1.2289979 -0.1370261 1.7079275 debye
polarizability: 275.0857601|7.6471233|220.6975209|17.1962163|0.1283932|177.2516335 unknown
InChI: InChI=1S/C13H7Cl5O2S/c1-21(19,20)10-5-9(16)12(17)11(13(10)18)7-4-6(14)2-3-8(7)15/h2-5H,1H3
charge 0 multiplicity 1
28 atoms
Cl 0.413435 -2.27089 0.190317
Cl -1.170398 3.043409 -0.168322
Cl 1.940031 3.942107 -0.451314
Cl -1.368696 0.250301 2.883825
Cl -4.686855 -1.026439 -2.461408
S  3.680968 -1.305726 -0.225707
O  3.413114 -2.458008 -1.34146
O  4.964206 -0.297382 -0.350796
C  2.167078 -0.10695 -0.126364
C  -0.218716 0.4365 -0.016882
C  0.831716 -0.51763 -0.006292
C  -1.651158 0.017543 0.104718
C  2.514755 1.243563 -0.265607
C  0.138441 1.805378 -0.156905
C  1.489457 2.205292 -0.277748
C  3.775082 -2.118954 1.501741
C  -2.294025 -0.107649 1.358595
C  -2.398981 -0.270247 -1.064925
C  -3.743867 -0.664491 -0.95025
C  -3.640598 -0.502962 1.46943
C  -4.380097 -0.786165 0.300403
H  3.572704 1.513976 -0.3722
H  2.857015 -2.70641 1.632504
H  4.675644 -2.747653 1.458455
H  3.874908 -1.300118 2.227042
H  -1.926337 -0.184016 -2.047365
H  -4.109978 -0.589497 2.453071
H  -5.426847 -1.094385 0.367744
