program: Gaussian 09
title: 000189437
version: EM64L-G09RevD.01
frameworkgroup: C1[X(C19H13ClF3NS)]
method: RPBEPBE
basis: SDD
operation: Freq
keyword: #p
keyword: freq=noraman
keyword: PBEPBE/SDD
title: #p freq=noraman PBEPBE/SDD
converged: NO YES NO NO
title: Mulliken charges:
elementType: Cl S F F F N C C C C C C C C C C C C C C C C C C C H H H H H H H H H H H H H
charge: -0.068767 0.210731 -0.166784 -0.167292 -0.164074 -0.100110 0.369803 0.049989 0.054602 -0.459789 0.431015 -0.286500 0.296983 -0.156491 -0.251465 -0.368077 -0.377768 -0.225911 -0.315414 -0.353856 0.238927 -0.239042 -0.238776 -0.223652 -0.857931 0.308144 0.237753 0.267960 0.229974 0.268429 0.237139 0.272721 0.257339 0.237668 0.238468 0.266038 0.269634 0.278380
chargesum: 0.00000
title: Mulliken charges with hydrogens summed into heavy atoms:
elementType: Cl S F F F N C C C C C C C C C C C C C C C C C C C
charge: -0.068767 0.210731 -0.166784 -0.167292 -0.164074 -0.100110 0.369803 0.049989 0.054602 -0.151645 0.431015 -0.048747 0.296983 -0.156491 0.016494 -0.138103 -0.109339 0.011228 -0.315414 -0.081134 0.238927 0.018297 -0.001108 0.014817 -0.043879
polarizability: 3.43457274e+02 -2.14329117e+00 3.09474278e+02 -1.89309245e+01 -1.05267962e+01 1.22819572e+02
1716.lowfreq: -5.1017 -4.3032 0.0028 0.0034 0.0035 1.7865 12.5203 14.2348 23.8635
frequency: 12.0222 14.0910 23.8566 38.2811 43.9392 59.4925 81.1540 89.1817 121.9290 129.3786 141.2973 174.9340 193.6050 205.3799 208.8329 230.7091 245.6904 264.6039 281.2124 300.2820 325.9844 342.7270 362.2856 395.5142 400.9162 425.1351 434.2424 449.0608 464.1991 487.1583 523.4895 553.3866 564.2402 599.9156 608.1314 622.8660 636.7958 663.7862 666.3073 678.3073 699.7831 716.6096 727.9007 746.3440 768.9695 793.4254 814.2736 850.9397 866.2017 873.5294 885.9998 930.3789 951.8992 953.2591 959.0451 968.6071 985.6003 988.0062 990.3594 992.7201 994.1114 1004.7021 1008.5439 1029.3561 1044.3637 1071.5228 1104.4158 1119.6612 1123.2202 1134.2467 1173.2765 1191.3227 1229.3276 1252.7630 1278.2935 1301.8979 1311.2642 1326.4491 1346.6931 1354.9096 1375.8644 1390.3865 1397.2128 1425.1893 1441.6713 1453.7205 1461.0775 1468.9403 1484.0209 1536.2399 1561.8894 1567.8285 1598.9571 1604.6922 1616.1254 3012.5859 3133.2644 3139.9157 3140.7733 3141.8446 3155.8892 3157.3345 3162.6825 3167.8235 3169.1899 3178.4405 3178.7383 3199.3243
redmass: 13.2747 7.6739 9.3068 3.8631 6.6248 6.9680 6.0060 5.0113 7.0731 6.3002 5.8934 2.4773 5.6485 3.3597 2.4160 5.7429 2.7458 6.8065 6.5743 6.5736 8.7616 6.1559 8.7699 10.3372 6.2235 4.5206 5.7106 4.4249 5.7842 4.9025 8.2166 5.6440 4.9603 5.0887 12.1105 7.0891 7.5563 5.9750 6.4492 7.4003 1.9168 7.7290 4.0592 2.3749 1.4536 7.9476 1.5841 6.5350 1.5016 1.6044 1.4452 1.4257 2.0496 1.8936 2.0039 1.1801 5.1194 4.7008 1.3808 1.3422 1.5622 6.5178 6.2162 4.7629 3.3501 2.1081 1.6641 2.0111 1.6107 2.2394 1.0576 1.1028 1.7803 1.5737 2.3468 1.5054 6.0338 2.9604 1.4022 2.7745 4.9725 2.8865 6.3530 2.4451 3.2216 1.0520 1.1387 2.6130 2.7223 8.4252 4.9848 6.2125 6.1762 7.0869 6.4743 1.0290 1.1064 1.1027 1.0861 1.0871 1.0906 1.0927 1.0915 1.0921 1.0947 1.1003 1.0981 1.0916
irintensity: 0.0315 0.3098 0.5778 3.1633 0.9631 0.2022 0.9701 0.1934 0.2438 0.0719 0.6130 2.6427 3.3654 0.6705 0.6010 0.9868 0.6988 0.3946 0.1275 0.3670 7.0359 0.3000 2.4172 8.3336 1.4858 0.9556 1.2908 3.3485 0.1683 6.1221 0.6998 7.9394 0.1034 3.3896 20.9086 12.8062 22.8858 2.2947 1.5645 16.4962 33.7063 32.3434 12.1247 17.7556 68.9117 24.9741 57.0014 14.9048 19.1173 10.3146 0.5211 12.6110 24.4552 16.3105 2.4197 8.1609 164.9074 12.9801 5.6661 8.8957 14.8053 67.7475 154.6384 37.2944 76.7246 8.7097 11.4048 9.8532 0.4545 18.0854 2.3038 11.5163 112.8792 17.8420 130.7920 30.4545 4.8619 59.7865 1.8124 2.5561 21.3142 68.6070 15.5203 15.5596 71.6130 17.5689 18.9215 31.9056 14.8063 148.8011 188.6038 69.6852 5.1465 7.8880 7.2816 17.0896 12.6443 6.7173 1.8703 9.6837 8.9210 2.1128 8.3340 3.7757 4.8618 17.7449 8.2869 0.2385
temp: 298.150 k
press: 1.00000 atm
elementType: 17 16 9 9 9 7 6 6 6 6 6 6 6 6 6 6 6 6 6 6 6 6 6 6 6 1 1 1 1 1 1 1 1 1 1 1 1 1
symmnumber: 1
zpe: 701311.6 jmol-1
zpe.correction: 0.267115 hartree
zpe.thermalcorrener: 0.289733 hartree
zpe.thermalcorrenthalpy: 0.290677 hartree
zpe.thermalcorrgfe: 0.210881 hartree
zpe.sumelectzpe: -1942.493278 hartree
zpe.sumelectthermal: -1942.470660 hartree
zpe.sumelectthermalent: -1942.469716 hartree
zpe.sumelectthermalfe: -1942.549512 hartree
dipole: -3.9932 -2.6340 -1.8031
dipole: 5.1122
quadrupole: -151.6807 -139.3100 -163.6847
quadrupole: -14.7686 -1.3039 -3.1288
quadrupole: -0.1222 12.2485 -12.1263 -14.7686 -1.3039 -3.1288
hfenergy: -1942.7603931 hartree
pointgroup: C01 [X(C19H13Cl1F3N1S1)]
dipole: 1.425283 -1.389864 0.2866732 debye
polarizability: 330.2374353|4.5947444|303.3362125|-53.5509599|36.7951|142.1774761 unknown
InChI: InChI=1S/C19H13ClF3NS/c1-25-14-10-17(12-5-4-6-13(9-12)19(21,22)23)24-18(11-14)15-7-2-3-8-16(15)20/h2-11H,1H3
charge 0 multiplicity 1
38 atoms
Cl 4.345264 0.329738 -2.203256
S  2.295181 -4.373138 -0.910873
F  -5.596477 1.847779 0.687832
F  -3.676807 2.516486 1.694849
F  -3.827333 2.528456 -0.562251
N  0.469594 -0.207487 0.055357
C  -1.762538 -1.151874 0.262135
C  -0.304154 -1.338453 -0.007198
C  1.812636 -0.307512 -0.178195
C  -2.295316 0.161245 0.293155
C  2.581408 0.970009 -0.045378
C  0.24819 -2.603529 -0.321437
C  -3.668041 0.367087 0.54698
C  1.643398 -2.711825 -0.537314
C  2.441474 -1.549738 -0.453607
C  -2.638482 -2.245644 0.500097
C  -4.537525 -0.723892 0.775943
C  -4.009195 -2.032169 0.750979
C  3.711855 1.354731 -0.81206
C  2.139254 1.900824 0.939644
C  -4.186731 1.775875 0.587889
C  4.386511 2.575064 -0.609769
C  2.799471 3.123433 1.163173
C  3.933957 3.461961 0.390828
C  4.116469 -4.035994 -1.223766
H  -1.613306 0.997493 0.113713
H  -0.387324 -3.488704 -0.412607
H  3.522116 -1.588058 -0.588577
H  -2.255435 -3.271065 0.509019
H  -5.600246 -0.551641 0.967815
H  -4.668404 -2.886581 0.934357
H  1.251467 1.627893 1.517661
H  5.245582 2.829164 -1.236837
H  2.431322 3.8087 1.933366
H  4.459285 4.409144 0.551491
H  4.540862 -5.006519 -1.52247
H  4.611417 -3.684215 -0.305832
H  4.239904 -3.309941 -2.041655
