program: Gaussian 09
title: 000189452
version: EM64L-G09RevD.01
frameworkgroup: C1[X(C14H18O10)]
method: RPBEPBE
basis: SDD
operation: Freq
keyword: #p
keyword: freq=noraman
keyword: PBEPBE/SDD
title: #p freq=noraman PBEPBE/SDD
converged: NO YES NO NO
title: Mulliken charges:
elementType: O O O O O O O O O O C C C C C C C C C C C C C C H H H H H H H H H H H H H H H H H H
charge: -0.376013 -0.271665 -0.416948 -0.427146 -0.446879 -0.431348 -0.512493 -0.438060 -0.415164 -0.262453 -0.112994 -0.208952 -0.106187 -0.011286 -0.023251 -0.388811 0.229553 0.085380 -0.040337 0.254698 0.210701 0.176912 -0.581528 -0.729398 0.200291 0.274807 0.245238 0.225032 0.238289 0.211966 0.250039 0.353045 0.337115 0.379729 0.349777 0.249582 0.422261 0.238025 0.260088 0.245739 0.369124 0.393521
chargesum: 0.00000
title: Mulliken charges with hydrogens summed into heavy atoms:
elementType: O O O O O O O O O O C C C C C C C C C C C C C C
charge: -0.376013 -0.271665 -0.063903 -0.090031 -0.067150 -0.081570 -0.090232 -0.068936 -0.021644 -0.262453 0.087298 0.065855 0.139051 0.213746 0.215038 0.073194 0.229553 0.085380 -0.040337 0.254698 0.210701 0.176912 -0.331946 0.014454
polarizability: 2.53950915e+02 6.97187258e-01 2.29098625e+02 -6.38785577e+00 -1.95644009e+00 1.10795088e+02
1716.lowfreq: -4.6414 0.0006 0.0010 0.0010 3.8037 5.6080 21.4077 36.4883 61.3127
frequency: 21.3483 36.4665 61.3109 69.8663 78.2779 87.3601 101.3892 114.4509 126.8458 153.4267 157.7433 166.1157 199.3365 201.9613 228.7056 240.4146 241.7728 270.7896 275.1141 294.8906 317.5241 325.4847 330.4791 338.8262 343.5132 349.0809 357.3547 372.4206 378.4226 410.3946 423.3566 434.7965 448.5420 457.7284 466.9464 525.1064 532.6848 553.2699 554.8544 569.7946 582.4991 594.4458 622.9748 642.6386 648.4925 668.0082 692.7651 736.1397 743.3240 819.4894 825.0040 841.4510 853.5502 907.2783 937.4429 941.0599 963.1764 984.1698 996.2862 1017.9618 1023.0503 1024.7918 1027.9908 1041.9103 1059.2449 1071.3842 1088.2325 1106.5368 1117.6806 1154.4757 1169.0234 1173.3292 1179.6447 1190.8923 1203.8735 1236.7488 1242.0998 1254.8777 1265.6411 1269.1218 1285.6327 1309.4908 1321.3546 1330.6840 1341.6453 1347.0853 1354.0634 1369.1482 1372.5593 1377.5743 1380.3736 1410.0751 1426.1536 1437.8276 1439.6636 1446.8499 1459.6180 1471.5604 1544.1486 1567.2192 1616.5800 1633.3018 2825.7455 2912.6228 2945.9379 2975.2643 2981.9172 2993.6846 3001.9648 3072.5723 3094.1073 3100.1715 3126.4781 3151.6365 3241.6556 3481.7504 3521.0364 3531.1116 3546.1690 3579.4755
redmass: 6.4364 6.4953 5.4369 6.4794 5.4020 6.4531 6.3694 6.8554 6.6731 2.6783 1.4453 3.4700 5.1629 4.8455 5.1425 5.1624 5.7010 6.4308 4.2808 4.3534 4.9874 4.6001 4.1473 1.3896 4.4350 1.4606 1.3274 3.5611 3.6568 4.5661 6.2672 1.2004 5.9134 4.2609 6.2984 4.1341 4.4768 1.2312 4.4021 3.3114 4.3130 3.4999 4.4881 4.8309 4.0145 6.5613 5.1806 1.1001 3.8694 1.6917 1.8105 2.6851 2.6201 4.4796 5.1417 7.6889 6.1678 2.4457 3.5375 3.0614 2.1303 2.3846 4.5912 3.7051 4.1559 3.6259 4.1943 2.8922 2.0865 4.0746 1.4752 1.5198 1.2187 1.2880 1.2541 2.0034 1.2275 1.2153 1.2081 2.2288 1.3023 1.4887 3.6569 1.3267 1.4428 1.2334 1.3889 1.1912 1.3424 1.2152 1.3622 3.7534 1.8659 1.5489 1.5592 1.1007 1.0826 2.9015 2.0518 7.0201 3.3648 5.4618 1.0743 1.0818 1.0826 1.0844 1.0685 1.0850 1.0357 1.0856 1.0954 1.0957 1.1030 1.0925 1.0692 1.0643 1.0658 1.0653 1.0668 1.0661
irintensity: 0.5343 1.4480 0.8975 3.1261 4.2149 3.9171 4.5999 2.6345 2.3665 2.4244 2.0975 6.2843 0.3292 1.2029 7.0076 4.4056 19.9744 5.9692 8.5648 10.9796 6.5558 0.6234 25.7237 61.4444 15.1985 98.8756 86.9574 31.0767 26.4290 2.1138 6.4260 177.2780 8.5929 10.3817 19.8982 13.6774 33.7489 158.5910 21.2295 3.1731 17.4666 4.1025 41.2231 7.5812 35.7108 6.3887 16.4679 186.9070 24.8749 57.7615 59.1575 108.3978 47.4858 260.8199 97.7356 125.6882 89.0185 5.2795 73.3737 72.7827 8.5405 26.4090 119.0754 91.6462 104.1471 8.3336 21.9940 45.7515 4.0727 9.6845 27.7202 265.2990 31.1595 20.7189 24.9858 179.5853 7.7311 11.5337 6.6575 79.7725 22.4306 93.9411 158.8089 24.1523 3.0315 6.6758 66.7985 17.7602 20.5376 52.8591 8.8236 159.3652 69.8532 26.7981 19.0443 18.2519 14.3963 209.7534 111.0349 247.0341 111.0140 85.9117 1361.2393 32.7170 16.9580 8.8270 44.8197 44.6855 1.6210 13.4843 8.5589 8.1472 15.1037 3.1993 824.6279 102.9732 12.1886 10.4305 22.4867 53.6424
temp: 298.150 k
press: 1.00000 atm
elementType: 8 8 8 8 8 8 8 8 8 8 6 6 6 6 6 6 6 6 6 6 6 6 6 6 1 1 1 1 1 1 1 1 1 1 1 1 1 1 1 1 1 1
symmnumber: 1
zpe: 830583.9 jmol-1
zpe.correction: 0.316353 hartree
zpe.thermalcorrener: 0.340324 hartree
zpe.thermalcorrenthalpy: 0.341268 hartree
zpe.thermalcorrgfe: 0.263776 hartree
zpe.sumelectzpe: -1294.636930 hartree
zpe.sumelectthermal: -1294.612959 hartree
zpe.sumelectthermalent: -1294.612015 hartree
zpe.sumelectthermalfe: -1294.689507 hartree
dipole: 2.6614 2.9379 -1.1474
dipole: 4.1269
quadrupole: -112.9732 -166.4636 -139.0849
quadrupole: -1.7910 2.3960 1.1440
quadrupole: 26.5341 -26.9564 0.4223 -1.7910 2.3960 1.1440
hfenergy: -1294.9532831 hartree
pointgroup: C01 [X(C14H18O10)]
dipole: -1.2743756 0.9054186 0.4386008 debye
polarizability: 253.5101567|4.2948525|229.6183099|-1.2894087|5.1372423|110.7161605 unknown
InChI: InChI=1S/C14H18O10/c1-4(16)8-5(17)2-6(18)9(19)13(8)24-14-12(22)11(21)10(20)7(3-15)23-14/h2,7,10-12,14-15,17-22H,3H2,1H3
charge 0 multiplicity 1
42 atoms
O  1.555708 1.07684 -0.328923
O  -0.069927 -0.559781 -0.726786
O  4.474689 -1.853915 -0.227228
O  5.169219 0.849241 0.679979
O  1.703048 -2.52949 0.657759
O  2.118483 3.890294 0.688184
O  -0.710558 2.270755 -0.462718
O  -4.724135 -1.577767 0.358469
O  -3.228629 3.034594 0.091121
O  -0.90972 -3.041046 0.084475
C  3.503709 -0.948938 0.380992
C  3.882556 0.512479 0.036716
C  2.108121 -1.37295 -0.112747
C  2.770174 1.507704 0.419817
C  1.062325 -0.264108 0.111966
C  3.043614 2.96285 0.032417
C  -1.361082 -0.137106 -0.303509
C  -2.382529 -1.128909 -0.12413
C  -1.631058 1.243698 -0.234814
C  -3.700304 -0.639472 0.140844
C  -2.95884 1.675654 0.037017
C  -2.060223 -2.589659 -0.213204
C  -3.986781 0.741345 0.231177
C  -3.115394 -3.573489 -0.694118
H  3.503574 -1.054382 1.493025
H  4.099241 0.591222 -1.042399
H  2.157959 -1.576868 -1.202969
H  2.550181 1.462331 1.511232
H  0.769779 -0.199139 1.182132
H  3.017965 3.060825 -1.072864
H  4.045516 3.246453 0.391526
H  5.380489 -1.537573 0.02977
H  5.06641 0.780776 1.666054
H  0.763726 -2.792846 0.401166
H  1.198375 3.754937 0.343817
H  -4.996842 1.106639 0.445932
H  0.247495 1.899781 -0.541335
H  -3.754198 -3.146545 -1.484148
H  -3.785893 -3.843277 0.141256
H  -2.60142 -4.480268 -1.050733
H  -5.575067 -1.118454 0.567684
H  -2.382955 3.526873 -0.097799
