program: Gaussian 09
title: 000189435
version: EM64L-G09RevD.01
frameworkgroup: C1[X(C19H13F4NS)]
method: RPBEPBE
basis: SDD
operation: Freq
keyword: #p
keyword: freq=noraman
keyword: PBEPBE/SDD
title: #p freq=noraman PBEPBE/SDD
converged: YES YES NO NO
title: Mulliken charges:
elementType: S F F F F N C C C C C C C C C C C C C C C C C C C H H H H H H H H H H H H H
charge: 0.210104 -0.158661 -0.150467 -0.183866 -0.203595 -0.094571 0.279024 0.038001 0.107250 0.041225 -0.250026 0.354379 -0.156691 -0.360077 -0.292615 -0.342236 0.225420 -0.229683 -0.226897 -0.347848 -0.338498 -0.375114 -0.391632 0.325528 -0.859517 0.275756 0.274141 0.240382 0.265809 0.239452 0.241752 0.284589 0.228702 0.256100 0.255777 0.286518 0.267482 0.264603
chargesum: 0.00000
title: Mulliken charges with hydrogens summed into heavy atoms:
elementType: S F F F F N C C C C C C C C C C C C C C C C C C C
charge: 0.210104 -0.158661 -0.150467 -0.183866 -0.203595 -0.094571 0.279024 0.038001 0.107250 0.041225 0.025730 0.354379 -0.156691 -0.085936 -0.052233 -0.076427 0.225420 0.009769 0.014855 -0.063259 -0.109796 -0.119014 -0.135855 0.325528 -0.040914
polarizability: 3.39227608e+02 -4.34723879e+00 2.87737543e+02 7.02978662e+00 5.46354946e+00 1.21417144e+02
1716.lowfreq: -6.0524 -4.1662 0.0014 0.0016 0.0017 5.3377 18.5880 30.8906 42.2774
frequency: 18.5158 30.8794 42.2736 51.5080 55.4437 66.7643 71.8022 89.3009 113.4057 154.8354 166.8703 185.4650 192.5968 215.0872 232.4998 236.3653 248.8695 270.6832 323.9059 329.9392 339.4235 361.4940 379.5543 394.4336 412.0730 424.3281 438.7265 471.2561 494.9632 510.9385 552.7422 561.5224 572.4172 573.7255 607.9692 626.7024 635.2729 643.4322 663.0603 706.2297 728.2061 745.2473 753.4873 764.2806 777.2005 799.2656 816.4486 834.0717 845.7761 871.8240 884.7828 891.8204 946.7925 948.1547 954.1686 969.1317 969.9585 982.5726 993.3227 995.6604 1000.7663 1003.4077 1012.7868 1032.7642 1062.9809 1101.9977 1116.6194 1121.3552 1141.2805 1156.6047 1182.8065 1202.5471 1244.9060 1254.0105 1278.8758 1293.0928 1308.0717 1323.3925 1341.8430 1353.9249 1375.3414 1394.5526 1398.8322 1416.9711 1437.1927 1455.5516 1463.6253 1483.1233 1498.3717 1536.0570 1562.5072 1579.3743 1596.4781 1609.2958 1611.9276 3013.7220 3134.4617 3140.6901 3140.9078 3146.4066 3157.4991 3158.6573 3162.5926 3171.5956 3176.1450 3180.4489 3181.4273 3201.4620
redmass: 9.6773 3.8297 4.4538 6.6737 6.4502 11.3360 7.9763 5.7012 5.1669 7.8179 5.9539 2.7566 3.1654 6.4418 4.6607 1.8105 7.7594 6.2824 6.2908 7.1263 7.2854 9.0304 6.3518 8.1148 2.9752 5.3549 7.4688 5.0564 3.4689 7.4199 7.1512 5.1807 4.8856 4.7156 10.8555 7.0890 6.8778 4.2727 7.2111 7.8725 4.0151 3.5552 4.3872 3.1685 1.5511 7.1264 1.3118 6.3522 1.5265 1.7595 1.4658 1.4904 2.3577 2.1873 4.9113 1.2633 1.4379 1.3683 9.0076 1.2866 1.3486 3.0222 6.1961 4.9698 2.3084 1.3866 1.9049 2.3333 1.8813 1.4584 1.0722 2.1777 1.8317 2.6973 1.7466 1.2869 6.0520 3.4307 2.6015 1.3464 8.2735 4.1834 3.8839 3.2182 2.4995 1.0512 1.0690 2.7301 2.8918 8.4152 4.8201 7.0853 7.8786 6.1759 6.4242 1.0289 1.1057 1.0867 1.1034 1.0896 1.0911 1.0909 1.0886 1.0945 1.0961 1.0994 1.0973 1.0915
irintensity: 0.9764 0.0335 2.3214 0.5916 0.2197 0.0959 1.4376 0.5009 0.2701 0.5753 2.3464 3.0959 0.5553 1.5501 0.2702 1.2125 1.7727 0.2389 1.1350 0.2857 1.2916 7.8837 2.4731 3.3010 0.1054 0.8017 0.7339 2.1197 4.4748 0.9811 31.2748 4.3962 16.3076 13.3204 16.1753 0.7986 5.6590 4.0518 2.1060 3.0322 1.7776 4.7141 11.9359 36.0336 79.3648 48.7324 8.0142 12.7903 86.2332 22.9627 2.3743 13.9179 57.6894 58.0274 25.1618 9.3390 15.5523 3.4690 126.9349 11.9076 0.4054 13.1744 188.2379 13.6347 9.1297 16.2475 18.8094 13.3112 28.6526 88.1280 2.3325 24.8681 47.6590 143.0089 51.9033 2.4455 6.1755 8.2221 0.9440 1.4073 10.4795 38.9759 62.5160 21.5818 14.5705 17.6302 54.8489 26.7893 140.8041 152.7159 235.5936 4.9933 13.4643 5.9615 48.9804 15.8275 11.6867 3.0506 6.8180 9.0813 10.8162 2.6241 1.0262 3.8025 4.8702 14.3602 6.6393 1.3519
temp: 298.150 k
press: 1.00000 atm
elementType: 16 9 9 9 9 7 6 6 6 6 6 6 6 6 6 6 6 6 6 6 6 6 6 6 6 1 1 1 1 1 1 1 1 1 1 1 1 1
symmnumber: 1
zpe: 704951.6 jmol-1
zpe.correction: 0.268502 hartree
zpe.thermalcorrener: 0.290554 hartree
zpe.thermalcorrenthalpy: 0.291499 hartree
zpe.thermalcorrgfe: 0.215076 hartree
zpe.sumelectzpe: -1582.272193 hartree
zpe.sumelectthermal: -1582.250140 hartree
zpe.sumelectthermalent: -1582.249196 hartree
zpe.sumelectthermalfe: -1582.325618 hartree
dipole: -2.4146 -0.1825 -2.7260
dipole: 3.6461
quadrupole: -158.9329 -129.7285 -154.9861
quadrupole: 9.5394 4.8723 2.3596
quadrupole: -11.0504 18.1540 -7.1036 9.5394 4.8723 2.3596
hfenergy: -1582.5406945 hartree
pointgroup: C01 [X(C19H13F4N1S1)]
dipole: 1.0928311 -0.1562507 -0.9160212 debye
polarizability: 334.6040143|-8.9282217|287.7107953|23.775759|-21.051858|126.067486 unknown
InChI: InChI=1S/C19H13F4NS/c1-25-14-10-17(12-6-8-13(20)9-7-12)24-18(11-14)15-4-2-3-5-16(15)19(21,22)23/h2-11H,1H3
charge 0 multiplicity 1
38 atoms
S  0.038503 -4.377519 -0.037171
F  4.379774 0.060602 2.535354
F  2.236359 -0.62828 2.398731
F  3.844667 -1.636277 1.147245
F  -6.574752 2.032826 -0.532389
N  -0.41369 0.245818 -0.281825
C  1.967408 0.678291 -0.276068
C  0.834668 -0.304744 -0.209102
C  3.157975 0.643071 0.514391
C  -1.506634 -0.586173 -0.271071
C  1.052094 -1.70467 -0.169245
C  -2.841939 0.075336 -0.348292
C  -0.070876 -2.561417 -0.134627
C  1.833785 1.729181 -1.222003
C  -1.366706 -1.993474 -0.173922
C  4.179881 1.606118 0.31341
C  3.383789 -0.355901 1.620591
C  2.848992 2.685315 -1.418136
C  4.035934 2.618109 -0.654875
C  -2.941774 1.47272 -0.102442
C  -4.024838 -0.645783 -0.667942
C  -4.183284 2.1360 -0.159515
C  -5.276559 0.000164 -0.732169
C  -5.327007 1.380454 -0.472144
C  1.886079 -4.666024 0.14854
H  2.068604 -2.098087 -0.172205
H  0.905547 1.772509 -1.798588
H  -2.246496 -2.639697 -0.110062
H  5.077109 1.572237 0.937296
H  2.715362 3.477668 -2.16227
H  4.834733 3.352457 -0.798941
H  -2.024683 2.019316 0.133274
H  -3.981091 -1.716094 -0.892764
H  -4.271357 3.208765 0.034939
H  -6.191478 -0.543916 -0.983144
H  2.275211 -4.128682 1.026548
H  2.422424 -4.366663 -0.764833
H  1.992166 -5.751162 0.299126
