program: Gaussian 09
title: 000182754
version: EM64L-G09RevD.01
frameworkgroup: C1[X(C15H9Cl2NO2)]
method: RPBEPBE
basis: SDD
operation: Freq
keyword: #p
keyword: freq=noraman
keyword: PBEPBE/SDD
title: #p freq=noraman PBEPBE/SDD
converged: YES YES NO NO
title: Mulliken charges:
elementType: Cl Cl O O N C C C C C C C C C C C C C C C H H H H H H H H H
charge: 0.014488 -0.010697 -0.197931 -0.211087 -0.363716 0.376089 -0.615321 0.076731 0.144824 0.086435 0.643983 -0.343577 -0.325208 -0.228889 -0.218137 -0.323119 -0.234328 -0.109069 -0.219226 -0.237605 0.277452 0.270107 0.240297 0.279170 0.250397 0.236890 0.240137 0.239858 0.261053
chargesum: 0.00000
title: Mulliken charges with hydrogens summed into heavy atoms:
elementType: Cl Cl O O N C C C C C C C C C C C C C C C
charge: 0.014488 -0.010697 -0.197931 -0.211087 -0.363716 0.376089 -0.067762 0.076731 0.144824 0.086435 0.643983 -0.103280 -0.046038 0.008001 -0.218137 -0.072723 0.005809 -0.109069 0.020632 0.023449
polarizability: 2.60175134e+02 1.12661482e+01 1.48009254e+02 1.07426763e+01 -5.80887590e-01 1.56508430e+02
1716.lowfreq: -5.1021 -2.0520 -0.0014 -0.0009 0.0015 5.7228 15.9544 28.7632 47.5013
frequency: 15.3616 28.7014 47.4673 50.1834 94.1836 109.0038 129.7606 189.8139 202.7798 208.6480 213.4295 266.9248 299.2449 304.6495 367.9846 382.2949 418.1704 424.2862 437.4276 462.6581 500.6216 507.9806 520.4160 538.2811 548.8551 594.6044 626.7437 657.8718 689.9680 703.0694 712.8943 729.1784 738.5521 783.0349 796.4313 849.8173 875.4411 884.4774 902.6007 944.9802 973.0046 981.3671 982.4711 1007.6922 1026.3327 1037.6314 1085.5833 1099.1012 1132.4830 1152.6999 1174.9399 1189.8560 1198.6344 1207.1951 1227.8551 1241.5280 1265.6493 1326.9185 1330.0884 1364.9796 1396.3012 1414.4864 1418.7791 1442.2787 1448.5324 1483.1539 1575.3823 1580.1125 1593.7743 1604.4179 1614.7041 1635.4178 2985.3258 3038.9354 3125.9862 3143.1976 3153.3266 3157.3126 3168.4790 3172.5459 3182.2195
redmass: 6.0082 7.9489 8.9289 4.9152 11.9215 8.3005 4.0189 21.7378 5.5998 4.6317 4.6413 5.6866 10.3259 6.9458 10.8787 9.5064 4.5672 6.6230 7.3265 3.1350 5.5988 3.9217 6.3530 8.2698 6.5876 4.2622 5.8075 6.6902 4.8423 6.0852 3.7286 5.6322 2.0127 1.5228 1.9780 4.5606 5.3407 1.3876 1.4855 2.3147 1.5272 1.6607 3.0710 1.3421 5.8069 2.2414 2.2595 2.6191 2.6415 1.5964 1.0761 1.5389 1.3922 1.5689 2.4288 2.5396 2.1182 2.1033 3.1556 11.8171 7.2199 2.8457 1.1232 2.7836 2.6003 2.5750 7.2669 9.0225 7.5889 8.4881 7.5298 10.5732 1.0638 1.0945 1.0879 1.0897 1.0871 1.0939 1.0930 1.1000 1.1000
irintensity: 0.1784 0.3278 2.0093 4.4760 1.3259 2.2506 4.2555 0.4122 2.6409 1.1422 3.3428 5.8736 0.1547 0.5969 20.1127 1.7914 5.1915 3.5087 11.2415 2.9738 0.2294 0.8164 12.0728 6.1937 9.7707 5.9629 5.6436 15.3257 9.4909 14.6208 23.3925 50.5598 50.0850 35.0944 25.1531 5.2092 11.3020 3.7222 5.8632 7.5553 1.9062 8.8162 13.1771 0.0981 21.6358 8.6869 9.0505 1.2452 77.7528 13.0948 7.0784 32.4498 22.5025 27.2132 72.0917 147.8770 53.9508 69.3787 148.9374 2.1134 1.4075 49.0911 14.4924 68.2143 21.6800 1.9879 20.0981 133.6283 9.7240 142.5539 150.9822 73.1141 2.7931 1.1291 4.2861 10.6052 3.7554 9.5026 3.2778 22.6672 6.3562
temp: 298.150 k
press: 1.00000 atm
elementType: 17 17 8 8 7 6 6 6 6 6 6 6 6 6 6 6 6 6 6 6 1 1 1 1 1 1 1 1 1
symmnumber: 1
zpe: 526951.9 jmol-1
zpe.correction: 0.200705 hartree
zpe.thermalcorrener: 0.217410 hartree
zpe.thermalcorrenthalpy: 0.218354 hartree
zpe.thermalcorrgfe: 0.153581 hartree
zpe.sumelectzpe: -1700.963736 hartree
zpe.sumelectthermal: -1700.947032 hartree
zpe.sumelectthermalent: -1700.946088 hartree
zpe.sumelectthermalfe: -1701.010861 hartree
dipole: -4.2122 1.6345 0.6751
dipole: 4.5684
quadrupole: -101.6072 -128.7297 -129.5203
quadrupole: 5.9507 10.7302 7.2926
quadrupole: 18.3452 -8.7773 -9.5679 5.9507 10.7302 7.2926
hfenergy: -1701.1644415 hartree
pointgroup: C01 [X(C15H9Cl2N1O2)]
dipole: 1.598374 0.2017695 -0.7968564 debye
polarizability: 261.595966|5.5964942|154.4410141|7.1645378|3.8554061|148.6558381 unknown
InChI: InChI=1S/C15H9Cl2NO2/c16-11-6-3-7-12(14(11)17)18-13(19)8-9-4-1-2-5-10(9)15(18)20/h1-7H,8H2
charge 0 multiplicity 1
29 atoms
Cl -1.645998 0.035937 2.29886
Cl -4.83704 -0.567419 1.889373
O  -0.541645 2.579062 -0.320996
O  0.290398 -2.010689 -0.358815
N  -0.104152 0.289045 -0.309237
C  2.705878 0.747954 0.115911
C  1.758255 1.927583 0.11914
C  2.216728 -0.573045 -0.047262
C  0.294726 1.649735 -0.193176
C  0.767296 -0.850535 -0.241054
C  -1.521725 0.02388 -0.485454
C  4.095834 0.94628 0.295591
C  3.107882 -1.678226 -0.026972
C  4.981642 -0.151356 0.314167
C  -2.357999 -0.117114 0.647478
C  -2.060289 -0.093691 -1.781298
C  4.486749 -1.470095 0.153427
C  -3.732503 -0.377769 0.467376
C  -3.435429 -0.354167 -1.952355
C  -4.276182 -0.497027 -0.82801
H  1.766324 2.420089 1.112808
H  2.091422 2.707484 -0.591118
H  4.483916 1.96398 0.422523
H  2.689027 -2.681677 -0.15305
H  -1.395615 0.018442 -2.642771
H  6.054931 0.017608 0.454101
H  5.174892 -2.321388 0.169853
H  -3.856879 -0.446664 -2.957604
H  -5.344551 -0.699516 -0.945438
