program: Gaussian 09
title: 000189424
version: EM64L-G09RevD.01
frameworkgroup: C1[X(C19H14F3NS)]
method: RPBEPBE
basis: SDD
operation: Freq
keyword: #p
keyword: freq=noraman
keyword: PBEPBE/SDD
title: #p freq=noraman PBEPBE/SDD
converged: YES YES NO NO
title: Mulliken charges:
elementType: S F F F N C C C C C C C C C C C C C C C C C C C H H H H H H H H H H H H H H
charge: 0.207381 -0.159707 -0.150138 -0.184141 -0.092779 0.278121 0.036225 0.107615 0.044294 -0.251817 0.335496 -0.156650 -0.359829 -0.294946 -0.342588 0.225013 -0.230374 -0.227762 -0.376142 -0.369852 -0.231149 -0.246349 -0.237582 -0.860107 0.274983 0.275805 0.242666 0.265146 0.238679 0.240879 0.277278 0.222573 0.227188 0.226333 0.229539 0.263576 0.286049 0.267072
chargesum: 0.00000
title: Mulliken charges with hydrogens summed into heavy atoms:
elementType: S F F F N C C C C C C C C C C C C C C C C C C C
charge: 0.207381 -0.159707 -0.150138 -0.184141 -0.092779 0.278121 0.036225 0.107615 0.044294 0.023166 0.335496 -0.156650 -0.084023 -0.052280 -0.077441 0.225013 0.008305 0.013117 -0.098864 -0.147280 -0.003961 -0.020017 -0.008043 -0.043410
polarizability: 3.32747134e+02 -6.35204316e+00 2.88076876e+02 1.08104826e+01 1.92490796e+00 1.21478654e+02
1716.lowfreq: -5.5158 -3.2683 0.0009 0.0015 0.0020 5.7295 20.7564 32.4379 45.1296
frequency: 20.7204 32.4048 45.1105 55.7477 58.3361 67.5591 85.1753 98.0579 114.6592 168.1493 176.7051 194.5184 209.6853 227.5358 236.7746 246.2987 265.6794 278.3275 328.6022 349.9601 364.4175 392.8603 403.8902 419.8323 435.2337 459.4742 474.4694 510.3462 561.1112 568.3787 573.7351 607.9121 615.5972 627.3611 640.7588 646.6353 665.5338 698.6849 707.5818 739.9848 757.5517 773.6666 781.4077 789.6665 829.2511 853.9152 870.7345 885.3932 892.7718 935.0741 947.0783 953.7906 968.7329 970.8311 983.7365 989.6829 992.6852 994.6322 1000.6718 1003.7600 1012.4843 1019.8193 1039.0028 1064.1608 1082.1982 1115.1847 1121.1107 1141.0373 1172.2560 1182.7929 1191.5176 1245.5127 1253.6774 1280.6484 1304.6777 1314.6107 1322.5443 1349.9004 1359.4152 1379.0905 1392.7348 1397.8332 1436.6451 1442.2402 1455.1649 1463.5780 1483.1698 1487.7978 1535.5970 1560.7321 1579.4040 1588.5604 1609.6729 1612.8208 3013.6560 3124.7092 3133.2700 3134.2374 3140.6622 3140.7630 3145.9474 3157.5871 3158.5785 3160.7088 3170.8329 3171.6461 3180.5637 3199.1428
redmass: 8.4764 3.7045 4.0368 6.8926 5.4287 12.2642 5.8777 5.0006 5.1776 6.3843 3.0549 5.2629 2.3498 3.1959 4.6408 2.5451 6.5531 6.4985 5.6327 7.8963 8.3745 6.6364 2.9284 5.7962 6.3181 4.9022 4.6675 8.8700 5.2833 4.7828 4.5917 10.9718 6.4296 7.1565 6.5929 4.3068 7.2511 1.7009 7.8360 3.4388 3.5565 1.5592 1.9626 3.9145 6.7357 1.2801 1.6863 1.4536 1.4761 1.4564 6.4366 5.2524 1.1878 1.5288 1.4271 5.2865 9.0236 1.2850 1.3476 1.3384 6.3766 3.8017 2.8809 2.2158 1.5732 1.9132 2.5363 1.8833 1.0572 1.0745 1.1331 1.8923 2.5849 1.7496 2.9777 1.9342 3.2527 1.2463 2.6887 7.9287 5.7888 2.6891 2.4185 2.3892 1.0515 1.0720 2.6717 2.5445 8.3950 4.7644 7.0901 6.2737 6.1689 6.0585 1.0289 1.0846 1.0882 1.1056 1.0867 1.1034 1.0937 1.0911 1.0943 1.0938 1.0987 1.0945 1.0993 1.0915
irintensity: 0.8282 0.0223 3.6680 0.3252 0.2625 0.3750 1.1060 0.1142 0.2766 2.4177 2.2401 1.0491 0.2930 0.6573 1.0933 0.1446 1.3688 0.5031 0.6187 4.8876 4.2246 2.6886 0.0478 0.2990 0.5364 1.7621 0.1159 0.3200 5.2141 0.9856 14.7018 20.4822 0.3127 11.7460 8.1934 7.7193 3.5575 50.5638 4.6783 6.8378 9.0139 106.5687 80.2379 13.0140 2.6167 1.7576 35.3191 2.0034 12.5801 2.3723 120.5735 24.4943 9.5224 14.7304 1.3231 0.9694 130.3817 11.1000 0.5242 1.5948 183.3297 16.8370 8.9262 9.4437 10.0942 16.4818 17.4202 24.0988 0.8217 1.1181 11.3857 54.2038 134.2115 50.1255 3.2489 2.2842 7.9629 0.5753 1.9554 7.7935 7.7811 90.7150 7.8093 2.6216 17.5915 49.8653 33.5699 14.1017 153.9319 273.0264 5.6210 1.0369 6.6204 0.2434 16.3685 2.6760 6.1516 11.9609 3.3027 7.0368 30.7380 10.9221 6.6806 21.9139 19.7868 4.1079 14.9496 1.2532
temp: 298.150 k
press: 1.00000 atm
elementType: 16 9 9 9 7 6 6 6 6 6 6 6 6 6 6 6 6 6 6 6 6 6 6 6 1 1 1 1 1 1 1 1 1 1 1 1 1 1
symmnumber: 1
zpe: 727202.3 jmol-1
zpe.correction: 0.276977 hartree
zpe.thermalcorrener: 0.298078 hartree
zpe.thermalcorrenthalpy: 0.299022 hartree
zpe.thermalcorrgfe: 0.225014 hartree
zpe.sumelectzpe: -1483.100845 hartree
zpe.sumelectthermal: -1483.079744 hartree
zpe.sumelectthermalent: -1483.078799 hartree
zpe.sumelectthermalfe: -1483.152808 hartree
dipole: -0.1880 -0.9235 -2.4180
dipole: 2.5951
quadrupole: -131.1094 -126.5430 -151.2310
quadrupole: 2.8563 7.1647 0.9815
quadrupole: 5.1851 9.7514 -14.9365 2.8563 7.1647 0.9815
hfenergy: -1483.3778216 hartree
pointgroup: C01 [X(C19H14F3N1S1)]
dipole: 0.2568193 -0.252501 0.9553678 debye
polarizability: 328.7559029|11.34429|289.2601701|-17.8836079|-18.5979408|124.2865918 unknown
InChI: InChI=1S/C19H14F3NS/c1-24-14-11-17(13-7-3-2-4-8-13)23-18(12-14)15-9-5-6-10-16(15)19(20,21)22/h2-12H,1H3
charge 0 multiplicity 1
38 atoms
S  -0.680636 4.251279 0.105447
F  4.173526 0.364967 -2.456127
F  1.96677 0.8218 -2.361627
F  3.428918 1.962621 -1.046672
N  -0.641074 -0.398982 0.240561
C  1.771906 -0.575213 0.274167
C  0.542072 0.283118 0.202674
C  2.971465 -0.39136 -0.481292
C  -1.817015 0.311178 0.228189
C  0.609564 1.698821 0.195816
C  -3.076849 -0.488858 0.266666
C  -0.598256 2.431133 0.160687
C  1.728698 -1.660673 1.189385
C  -1.82619 1.727934 0.165093
C  4.086517 -1.243523 -0.273569
C  3.116749 0.652501 -1.558895
C  2.836309 -2.506346 1.392212
C  4.028885 -2.290324 0.66607
C  -3.03166 -1.876671 -0.037836
C  -4.328618 0.092545 0.607319
C  -4.205397 -2.657356 -0.015113
C  -5.502594 -0.689835 0.63214
C  -5.447897 -2.067791 0.318005
C  1.129314 4.737014 -0.038304
H  1.57759 2.199232 0.22478
H  0.794837 -1.819571 1.73583
H  -2.770358 2.275956 0.100879
H  4.990273 -1.096619 -0.871067
H  2.769637 -3.328571 2.112595
H  4.899031 -2.937305 0.815674
H  -2.06204 -2.316129 -0.289744
H  -4.392825 1.151816 0.879286
H  -4.153622 -3.724258 -0.259714
H  -6.458045 -0.226805 0.902916
H  -6.360732 -2.673691 0.336127
H  1.123184 5.830662 -0.162255
H  1.587313 4.2649 -0.920545
H  1.678948 4.472802 0.878042
