program: Gaussian 09
title: 000189417
version: EM64L-G09RevD.01
frameworkgroup: C1[X(C18H14FNS)]
method: RPBEPBE
basis: SDD
operation: Freq
keyword: #p
keyword: freq=noraman
keyword: PBEPBE/SDD
title: #p freq=noraman PBEPBE/SDD
converged: YES YES NO NO
title: Mulliken charges:
elementType: S F N C C C C C C C C C C C C C C C C C C H H H H H H H H H H H H H H
charge: 0.209760 -0.204430 -0.093343 0.026862 0.061373 0.351636 0.336430 -0.258150 -0.302894 -0.154101 -0.343367 -0.345389 -0.369955 -0.374291 -0.391156 -0.375719 -0.245782 -0.230449 0.324338 -0.237655 -0.859858 0.235550 0.242337 0.224234 0.282260 0.222638 0.272402 0.254232 0.256108 0.226206 0.227181 0.229734 0.267116 0.268701 0.267440
chargesum: 0.00000
title: Mulliken charges with hydrogens summed into heavy atoms:
elementType: S F N C C C C C C C C C C C C C C C C C C
charge: 0.209760 -0.204430 -0.093343 0.026862 0.061373 0.351636 0.336430 -0.022600 -0.060557 -0.154101 -0.119132 -0.063129 -0.147317 -0.101889 -0.136924 -0.119611 -0.019575 -0.003268 0.324338 -0.007921 -0.056601
polarizability: 3.30533643e+02 1.27123279e+01 2.94205262e+02 9.16446694e+00 3.06697462e-01 9.29780554e+01
1716.lowfreq: -5.6344 -2.5670 -0.0013 0.0010 0.0013 2.8130 29.9093 34.4966 44.8120
frequency: 29.8939 34.4662 44.7965 55.2758 61.3289 93.4909 98.6177 153.6689 184.4220 189.3315 220.6266 235.1465 241.4359 254.0169 299.2673 336.7405 365.0937 396.3890 404.6240 412.7965 427.7547 465.4208 492.7067 539.9373 563.0425 571.5198 616.0648 626.1726 636.0662 640.1255 668.2625 698.6421 722.7955 741.4224 756.3274 782.6138 793.7570 814.7874 830.2550 841.0891 852.6470 860.1346 874.4201 934.2025 944.5960 953.1347 967.8067 979.3775 983.3489 989.9004 990.0827 1002.8486 1003.5591 1020.8173 1045.1105 1081.0634 1101.3231 1114.2691 1125.3463 1155.4785 1172.1374 1190.8691 1200.5857 1245.2037 1290.9312 1305.3939 1311.3136 1323.7775 1346.1618 1349.1753 1377.4388 1395.8616 1397.8494 1416.4148 1441.4827 1454.4643 1462.4909 1486.1875 1498.1535 1536.2297 1558.8917 1588.4085 1596.8007 1611.4765 1612.9726 3009.7063 3124.6330 3128.6560 3133.1915 3136.6240 3144.5317 3145.8432 3158.9594 3161.4282 3162.5005 3171.3534 3173.4449 3176.2127 3181.3594
redmass: 3.7334 3.7797 3.6758 7.5897 6.7200 5.0106 5.3731 4.0065 3.6957 4.3524 1.8555 2.4739 6.2184 4.5002 7.0673 7.0086 6.7197 5.2778 2.9015 3.0311 6.0836 3.9992 3.1591 5.3621 6.8993 4.3037 6.4033 6.8222 5.8054 4.3204 7.2133 1.6823 3.5843 2.7679 7.7308 1.9021 7.1921 1.3082 6.4785 1.4991 1.2903 1.8623 1.5062 1.4551 1.3868 6.4023 1.1781 1.3762 1.4514 1.5021 3.2138 1.4317 2.5819 3.1711 2.5289 1.5839 1.3423 1.9497 2.2663 1.4416 1.0573 1.1409 2.1895 1.7234 1.2878 2.9476 2.1555 2.8475 1.3835 2.5768 4.4944 5.3252 4.2275 3.4904 2.3753 1.0523 1.0692 2.5203 2.8813 8.7563 4.7057 6.2605 7.9118 6.4716 6.0826 1.0290 1.0846 1.1064 1.0882 1.1021 1.0888 1.0936 1.0955 1.0929 1.0885 1.0984 1.0919 1.0948 1.0972
irintensity: 0.0408 0.0293 2.4873 0.4407 0.0680 0.4632 1.1187 0.0080 2.2439 2.4584 0.3965 0.2786 0.9692 0.4790 2.8875 0.2794 1.9233 0.7834 0.0926 0.1968 0.6384 1.3291 7.1903 7.8433 29.0238 27.4032 0.1351 2.8144 9.4273 7.8143 2.4198 52.0263 0.8135 4.7310 20.6624 60.3774 39.9665 7.3164 19.7892 93.6007 1.2122 1.5895 6.5515 2.7764 0.2545 0.5187 9.4929 3.8802 1.2995 5.7548 0.9895 1.7834 10.4804 7.7557 17.7463 8.0672 16.8907 8.1426 3.3015 86.8446 0.7776 9.1074 26.3964 27.3834 3.4319 2.2412 3.6779 5.4536 0.0854 1.6434 13.4398 32.4988 73.8640 36.5584 3.3499 17.4102 49.2188 43.5986 108.8370 214.4876 267.1931 1.2935 15.0630 41.4463 0.9373 19.3497 2.5486 15.6887 5.8364 6.9068 10.2193 31.6809 13.3582 17.0590 0.8022 18.3382 0.6474 7.5085 6.7197
temp: 298.150 k
press: 1.00000 atm
elementType: 16 9 7 6 6 6 6 6 6 6 6 6 6 6 6 6 6 6 6 6 6 1 1 1 1 1 1 1 1 1 1 1 1 1 1
symmnumber: 1
zpe: 696817.4 jmol-1
zpe.correction: 0.265404 hartree
zpe.thermalcorrener: 0.283609 hartree
zpe.thermalcorrenthalpy: 0.284553 hartree
zpe.thermalcorrgfe: 0.216999 hartree
zpe.sumelectzpe: -1245.531572 hartree
zpe.sumelectthermal: -1245.513367 hartree
zpe.sumelectthermalent: -1245.512423 hartree
zpe.sumelectthermalfe: -1245.579977 hartree
dipole: -0.7563 2.8601 0.0147
dipole: 2.9584
quadrupole: -128.3236 -110.9110 -135.2716
quadrupole: 16.7633 2.8505 0.3033
quadrupole: -3.4882 13.9244 -10.4362 16.7633 2.8505 0.3033
hfenergy: -1245.796976 hartree
pointgroup: C01 [X(C18H14F1N1S1)]
dipole: -0.302116 -1.1187901 0.1084367 debye
polarizability: 330.3743109|-13.7862028|292.3402172|-8.5157093|-19.8104771|95.0024316 unknown
InChI: InChI=1S/C18H14FNS/c1-21-16-11-17(13-5-3-2-4-6-13)20-18(12-16)14-7-9-15(19)10-8-14/h2-12H,1H3
charge 0 multiplicity 1
35 atoms
S  -1.075565 -4.312653 0.530737
F  5.791716 2.028723 -0.059768
N  -0.377745 0.261223 0.045602
C  0.706487 -0.567297 0.138563
C  -1.639181 -0.276877 0.096656
C  2.047143 0.087823 0.076454
C  -2.778638 0.682764 -0.007195
C  0.569942 -1.972662 0.306586
C  -1.84669 -1.673896 0.223655
C  -0.726134 -2.53068 0.340453
C  3.234071 -0.642317 -0.204173
C  2.147536 1.489148 0.297962
C  -4.098373 0.329795 0.385963
C  -2.545971 1.993219 -0.506116
C  4.490009 -0.002266 -0.252936
C  3.392451 2.147124 0.257045
C  -5.155512 1.257594 0.274001
C  -3.602849 2.91923 -0.620306
C  4.539909 1.381935 -0.015952
C  -4.914262 2.555827 -0.232658
C  0.641574 -5.068016 0.604037
H  1.456006 -2.598425 0.429021
H  -2.85727 -2.09091 0.213522
H  3.189531 -1.715561 -0.415335
H  1.226707 2.042441 0.501281
H  -4.305821 -0.660375 0.806234
H  -1.525693 2.25818 -0.798456
H  5.407958 -0.553133 -0.476603
H  3.480187 3.223062 0.433107
H  -6.165169 0.970912 0.588666
H  -3.40639 3.923195 -1.012987
H  -5.736373 3.274936 -0.320005
H  0.474609 -6.151868 0.698843
H  1.191926 -4.703594 1.4852
H  1.197276 -4.861604 -0.323799
