program: Gaussian 09
title: 000189416
version: EM64L-G09RevD.01
frameworkgroup: C1[X(C19H17NS)]
method: RPBEPBE
basis: SDD
operation: Freq
keyword: #p
keyword: freq=noraman
keyword: PBEPBE/SDD
title: #p freq=noraman PBEPBE/SDD
converged: YES YES NO NO
title: Mulliken charges:
elementType: S N C C C C C C C C C C C C C C C C C C C H H H H H H H H H H H H H H H H H
charge: 0.205535 -0.090517 0.348439 0.045369 0.030289 0.333538 -0.503233 -0.301827 0.446965 -0.156561 -0.259945 -0.386305 -0.428860 -0.233802 -0.374810 -0.374093 -0.814210 -0.246594 -0.231690 -0.239518 -0.860693 0.275618 0.241226 0.237093 0.223714 0.232212 0.223538 0.217278 0.274914 0.233188 0.220487 0.231850 0.224495 0.226560 0.228930 0.265415 0.268353 0.267651
chargesum: 0.00000
title: Mulliken charges with hydrogens summed into heavy atoms:
elementType: S N C C C C C C C C C C C C C C C C C C C
charge: 0.205535 -0.090517 0.348439 0.045369 0.030289 0.333538 -0.227615 -0.060602 0.446965 -0.156561 -0.022852 -0.162591 -0.196648 -0.010264 -0.157531 -0.099178 -0.128684 -0.022098 -0.005129 -0.010588 -0.059274
polarizability: 3.42545451e+02 9.54598572e-01 3.05905939e+02 1.15579071e+01 -1.68831139e+00 1.03268305e+02
1716.lowfreq: -32.1384 -6.2447 -2.9860 0.0016 0.0019 0.0021 2.2550 21.5754 30.2594
frequency: -32.0908 21.4729 30.2308 38.0239 60.8374 63.9848 99.6973 99.8669 170.9155 184.2303 199.9417 209.3824 218.9122 232.1854 249.6456 267.3957 304.4017 357.6501 383.6427 403.2049 424.9726 442.2073 465.0335 501.5070 515.9323 554.6731 581.9847 615.3727 628.8393 645.7308 651.2489 669.4570 698.4972 705.1315 735.2887 752.2680 782.1919 795.0888 800.8901 850.5117 860.0631 872.6170 890.9555 901.5798 932.4009 942.3638 953.8497 967.5364 981.2423 981.7329 985.6738 989.6217 990.8320 997.9687 1002.6184 1023.3682 1050.6182 1055.3236 1080.8623 1100.2510 1116.2271 1124.0693 1171.4318 1186.2002 1190.3174 1199.4583 1257.5434 1298.1127 1304.6667 1315.1505 1322.4569 1345.8383 1362.6918 1380.6414 1387.1038 1393.9678 1396.9722 1434.4899 1441.4560 1453.9973 1462.6292 1469.1506 1473.2063 1486.3563 1489.0043 1536.9676 1557.0515 1588.0286 1595.9829 1612.2938 1614.7625 2977.6444 3008.8720 3057.3514 3083.5489 3120.6486 3122.8634 3127.0936 3131.2721 3135.6272 3136.0929 3144.1840 3145.5563 3155.8143 3159.0209 3161.7850 3170.8149 3176.1891
redmass: 1.0272 3.6482 3.6584 3.4904 5.2218 6.1044 4.3865 4.3939 3.1503 3.8464 2.5708 3.0368 3.8554 1.6041 4.7387 5.4586 5.2948 3.9515 5.3374 2.8640 3.6959 3.9526 3.8784 4.2843 4.9038 5.0322 4.3649 6.4453 7.3376 7.3114 3.9011 7.2381 1.6886 1.8583 2.7504 7.1779 1.8385 3.8818 1.9848 1.3708 1.6329 1.5070 4.0761 1.3262 1.4580 1.4514 6.1056 1.1798 1.3925 1.4351 2.9068 4.3865 1.3569 2.0246 1.3414 2.5878 1.6152 2.3576 1.5758 1.5447 1.8838 2.1503 1.0579 1.1355 1.1260 1.9014 2.0090 1.5159 2.2143 2.3656 2.6134 1.2188 3.3782 4.6568 2.9340 3.4875 1.5410 2.7211 2.5196 1.0528 1.0689 1.0459 1.4322 2.3517 1.9353 8.6618 4.7586 6.2617 5.6995 6.1105 6.4743 1.0369 1.0291 1.0976 1.0990 1.0861 1.0846 1.1064 1.0880 1.0913 1.1021 1.0936 1.0913 1.0982 1.0970 1.0921 1.0981 1.0906
irintensity: 0.4046 0.2849 0.0344 3.1055 0.0895 0.4237 0.3130 0.8701 2.9706 1.9634 1.1225 0.4763 0.1169 0.0957 1.2641 0.2643 0.9465 0.5156 0.4237 0.0057 0.5102 3.0892 0.9131 5.3353 1.7233 1.8098 10.5388 0.3482 15.3078 15.5701 4.2135 1.7102 56.9603 17.8914 8.0294 43.1658 59.7665 31.1171 26.1481 5.6049 18.5579 5.4798 0.1830 0.9182 2.8925 5.2394 0.3116 9.7189 0.4899 1.7754 0.7878 1.2139 6.0194 1.9127 2.2461 11.0878 13.4784 19.0423 10.5826 14.2909 13.3565 1.0201 1.4183 2.7623 6.0367 20.2311 13.2579 2.4136 2.7502 3.7560 1.2603 1.3532 1.1576 17.7607 34.3336 38.1451 17.2623 17.3139 13.9804 17.7232 45.9995 13.4834 4.1897 44.0544 13.5037 211.8554 315.8844 2.3946 5.3993 1.0596 6.7104 35.1993 20.2120 19.8359 23.4479 3.8046 4.2887 15.8900 4.4763 29.5341 8.4762 33.1908 6.0010 18.9090 27.1897 9.7833 16.4936 5.5787
temp: 298.150 k
press: 1.00000 atm
elementType: 16 7 6 6 6 6 6 6 6 6 6 6 6 6 6 6 6 6 6 6 6 1 1 1 1 1 1 1 1 1 1 1 1 1 1 1 1 1
symmnumber: 1
zpe: 789275.3 jmol-1
zpe.correction: 0.300619 hartree
zpe.thermalcorrener: 0.318996 hartree
zpe.thermalcorrenthalpy: 0.319940 hartree
zpe.thermalcorrgfe: 0.251832 hartree
zpe.sumelectzpe: -1185.589745 hartree
zpe.sumelectthermal: -1185.571368 hartree
zpe.sumelectthermalent: -1185.570424 hartree
zpe.sumelectthermalfe: -1185.638533 hartree
dipole: 1.8809 0.4663 0.1834
dipole: 1.9465
quadrupole: -104.0327 -117.8863 -137.9359
quadrupole: 6.4484 2.4986 -0.3908
quadrupole: 15.9189 2.0654 -17.9843 6.4484 2.4986 -0.3908
hfenergy: -1185.8903643 hartree
pointgroup: C01 [X(C19H17N1S1)]
dipole: -0.6841914 -0.3258386 0.1104152 debye
polarizability: 340.4621384|7.0561245|305.2152702|-12.94008|-23.5010813|106.0422868 unknown
InChI: InChI=1S/C19H17NS/c1-14-7-6-10-16(11-14)19-13-17(21-2)12-18(20-19)15-8-4-3-5-9-15/h3-13H,1-2H3
charge 0 multiplicity 1
38 atoms
S  -0.713688 -4.41902 0.621596
N  0.004787 0.132633 -0.023463
C  2.423469 -0.184407 -0.000268
C  1.04559 -0.754566 0.090607
C  -1.280229 -0.32943 0.054126
C  -2.36366 0.691687 -0.076868
C  2.61028 1.212139 0.163824
C  0.822231 -2.13833 0.305877
C  3.893682 1.80587 0.095123
C  -0.506719 -2.62151 0.367705
C  -1.575076 -1.709572 0.231537
C  3.560204 -1.000815 -0.251371
C  5.012908 0.97006 -0.149063
C  4.843455 -0.423142 -0.324138
C  -3.696742 0.437901 0.34626
C  -2.059912 1.96332 -0.634868
C  4.059535 3.304795 0.282186
C  -4.698081 1.42256 0.206314
C  -3.060548 2.946096 -0.777205
C  -4.386287 2.680544 -0.359554
C  -2.579152 -4.613254 0.695804
H  1.721596 1.825539 0.347495
H  1.662329 -2.824755 0.441766
H  -2.612606 -2.049112 0.238899
H  3.449109 -2.077811 -0.416494
H  6.015902 1.409832 -0.206752
H  5.714466 -1.05697 -0.525265
H  -3.956924 -0.518175 0.814034
H  -1.029004 2.152124 -0.948382
H  3.69836 3.626313 1.277027
H  5.116116 3.610781 0.191504
H  3.47804 3.868817 -0.470929
H  -5.718529 1.212157 0.545821
H  -2.809256 3.918636 -1.215281
H  -5.164498 3.444212 -0.468777
H  -2.750285 -5.686528 0.870397
H  -3.04164 -4.31881 -0.258957
H  -2.997527 -4.033204 1.533035
