program: Gaussian 09
title: 000189415
version: EM64L-G09RevD.01
frameworkgroup: C1[X(C18H13Cl2NS)]
method: RPBEPBE
basis: SDD
operation: Freq
keyword: #p
keyword: freq=noraman
keyword: PBEPBE/SDD
title: #p freq=noraman PBEPBE/SDD
converged: YES YES NO NO
title: Mulliken charges:
elementType: Cl Cl S N C C C C C C C C C C C C C C C C C C H H H H H H H H H H H H H
charge: -0.066543 -0.054728 0.214210 -0.094487 0.029075 0.062151 0.357613 0.360660 -0.254687 -0.295184 -0.156148 -0.363851 -0.361740 -0.331395 -0.382148 -0.228309 -0.216640 -0.103022 -0.226171 -0.109909 -0.238650 -0.859261 0.237309 0.240694 0.223580 0.280657 0.299113 0.227324 0.254574 0.257665 0.232994 0.258857 0.269740 0.268145 0.268512
chargesum: 0.00000
title: Mulliken charges with hydrogens summed into heavy atoms:
elementType: Cl Cl S N C C C C C C C C C C C C C C C C C C
charge: -0.066543 -0.054728 0.214210 -0.094487 0.029075 0.062151 0.357613 0.360660 -0.017378 -0.054490 -0.156148 -0.140271 -0.081083 -0.032282 -0.154824 0.026265 0.041025 -0.103022 0.006823 -0.109909 0.020207 -0.052865
polarizability: 3.61285442e+02 -5.93102498e+00 3.35202964e+02 1.39500176e+01 2.82505690e+00 9.86426211e+01
1716.lowfreq: -3.4344 -0.0016 0.0007 0.0013 1.8985 4.4129 17.2155 32.7605 38.6196
frequency: 17.2137 32.7558 38.6179 45.2330 51.0442 83.8285 90.9454 138.4991 152.9562 175.8365 185.9045 195.3941 217.2475 222.8124 239.4934 252.1247 299.0763 317.6861 341.5125 369.9863 389.1708 409.0134 427.4433 439.7374 469.3835 481.2198 501.7893 554.1843 579.0940 624.3283 631.7628 644.4984 667.7918 677.4318 693.2112 697.1621 721.0060 739.4437 788.0544 794.3904 824.3632 841.2216 844.6286 862.9055 873.1038 903.2452 928.9755 952.4198 954.6240 968.8696 976.0194 983.4502 985.4674 990.9472 997.6429 1043.5529 1072.2589 1073.8901 1092.8930 1106.4212 1116.1967 1127.7307 1183.0311 1186.3015 1240.6268 1280.3501 1293.7983 1308.9702 1319.3970 1344.4196 1347.5530 1369.6858 1390.4166 1391.3290 1407.5137 1427.5221 1454.8509 1461.9634 1470.4577 1483.5811 1535.4654 1558.2988 1573.3403 1581.2696 1599.9687 1605.8206 3009.6760 3128.4491 3137.1935 3139.0070 3141.2563 3156.8991 3160.5360 3163.0068 3171.3677 3175.4572 3177.2129 3179.3225 3180.4788
redmass: 7.2200 3.9152 6.2733 5.1382 7.7585 6.6467 5.5998 4.6163 7.3453 5.4396 3.7948 3.9303 2.4732 4.9471 2.2346 5.5931 6.4095 5.6986 6.1089 6.7003 10.0171 2.9177 4.4657 4.1626 6.9604 3.6310 5.3443 5.0674 4.5828 7.1578 7.2961 4.3996 7.2070 8.0322 2.2863 6.6354 3.3024 2.5204 4.9496 1.7622 1.3645 1.4900 5.3443 1.8897 1.5045 1.3841 1.4800 1.4908 4.7971 1.1795 1.3789 2.6700 1.9163 1.3258 3.7185 4.6154 2.0501 2.5681 1.5259 1.4061 1.9864 2.3264 1.1150 1.1408 1.6291 1.4235 1.2847 5.2223 3.0814 2.4790 1.4748 3.9384 4.3793 5.8972 3.2327 2.8886 1.0522 1.0880 2.6568 2.7193 8.7249 4.6743 6.8955 7.8218 6.2786 6.6989 1.0291 1.1064 1.1021 1.0868 1.0887 1.0936 1.0885 1.0915 1.0954 1.0910 1.0966 1.0969 1.0934
irintensity: 0.0839 0.0482 0.8081 1.7440 0.4655 0.1092 1.0455 0.0182 0.0353 1.2814 1.7697 0.5263 0.2457 0.3626 0.5617 1.4748 1.2526 2.3115 0.5061 0.6083 10.4621 0.3761 2.3662 8.2869 18.7065 10.2435 5.9485 3.8159 13.2089 0.9127 4.6669 4.5612 2.3129 13.9604 33.2079 70.6263 1.4466 3.9306 51.4163 41.7667 20.3631 58.1909 30.5331 2.7800 10.5240 0.6551 12.8207 0.2443 0.0916 9.0731 0.5996 2.8905 8.6872 2.5634 44.8983 47.6295 17.5824 49.3570 2.7955 22.1443 7.2042 9.5233 6.5972 7.0160 37.3236 1.2499 1.5002 4.5783 1.9649 1.0697 4.7930 21.4266 59.5777 24.7428 26.4497 26.9095 17.6525 63.0624 53.8666 67.4355 218.7399 329.7653 5.6833 12.9145 35.5289 17.2757 18.3332 15.0923 6.5066 10.2002 10.6000 5.5880 0.4605 6.5291 3.6958 5.4912 4.5167 3.9496 8.3517
temp: 298.150 k
press: 1.00000 atm
elementType: 17 17 16 7 6 6 6 6 6 6 6 6 6 6 6 6 6 6 6 6 6 6 1 1 1 1 1 1 1 1 1 1 1 1 1
symmnumber: 1
zpe: 667844.6 jmol-1
zpe.correction: 0.254369 hartree
zpe.thermalcorrener: 0.274304 hartree
zpe.thermalcorrenthalpy: 0.275249 hartree
zpe.thermalcorrgfe: 0.202683 hartree
zpe.sumelectzpe: -2065.141328 hartree
zpe.sumelectthermal: -2065.121392 hartree
zpe.sumelectthermalent: -2065.120448 hartree
zpe.sumelectthermalfe: -2065.193014 hartree
dipole: 0.0832 5.2520 -0.3138
dipole: 5.2620
quadrupole: -140.7517 -140.8257 -154.7907
quadrupole: 9.6200 5.5995 2.8239
quadrupole: 4.7044 4.6303 -9.3347 9.6200 5.5995 2.8239
hfenergy: -2065.3956965 hartree
pointgroup: C01 [X(C18H13Cl2N1S1)]
dipole: 0.0396651 -2.0696294 -0.0298557 debye
polarizability: 362.3651556|-4.9138827|334.0728222|0.021562|-14.0056858|98.6930493 unknown
InChI: InChI=1S/C18H13Cl2NS/c1-22-16-10-17(12-5-7-14(19)8-6-12)21-18(11-16)13-3-2-4-15(20)9-13/h2-11H,1H3
charge 0 multiplicity 1
35 atoms
Cl 3.59738 4.133969 0.636153
Cl -6.01019 2.728742 -0.393805
S  0.379786 -4.620989 0.464968
N  0.247411 0.013119 0.088036
C  -0.93011 -0.682204 0.106686
C  1.431199 -0.672615 0.182401
C  -2.179699 0.127511 -0.000872
C  2.678736 0.149487 0.157152
C  -0.965248 -2.100612 0.203481
C  1.468328 -2.082546 0.316127
C  0.251342 -2.806955 0.317114
C  -3.451767 -0.390248 0.364163
C  -2.105312 1.464726 -0.476886
C  2.577998 1.551491 0.368547
C  3.959807 -0.419741 -0.075381
C  -4.619127 0.393605 0.249113
C  -3.261292 2.26094 -0.601195
C  3.741488 2.334472 0.353545
C  5.113632 0.39191 -0.087334
C  -4.506121 1.710215 -0.237665
C  5.019893 1.78576 0.131096
C  -1.416236 -5.166404 0.446864
H  -1.9208 -2.62734 0.167154
H  2.418844 -2.609776 0.434257
H  -3.546924 -1.40287 0.769852
H  -1.123525 1.863714 -0.746225
H  1.5904 1.986699 0.539303
H  4.065193 -1.491318 -0.271547
H  -5.594145 -0.0078 0.539604
H  -3.196842 3.287066 -0.974166
H  6.095302 -0.056142 -0.273772
H  5.909041 2.422307 0.124457
H  -1.896656 -4.897179 -0.506443
H  -1.962153 -4.737709 1.301542
H  -1.384434 -6.262282 0.544379
