program: Gaussian 09
title: 000189411
version: EM64L-G09RevD.01
frameworkgroup: C1[X(C20H13F6NS)]
method: RPBEPBE
basis: SDD
operation: Freq
keyword: #p
keyword: freq=noraman
keyword: PBEPBE/SDD
title: #p freq=noraman PBEPBE/SDD
converged: YES YES NO NO
title: Mulliken charges:
elementType: S F F F F F F N C C C C C C C C C C C C C C C C C C C C H H H H H H H H H H H H H
charge: 0.221214 -0.166287 -0.163975 -0.164699 -0.166971 -0.162795 -0.166152 -0.092868 0.059245 0.030291 0.371082 0.364695 -0.290284 -0.249348 -0.482549 -0.163168 0.293412 -0.361723 -0.359882 -0.369402 0.291057 -0.353327 -0.353219 -0.344279 -0.227331 0.242666 0.250254 -0.858077 0.241382 0.239805 0.304289 0.226549 0.284501 0.231946 0.261155 0.266311 0.266450 0.238869 0.270575 0.269434 0.271156
chargesum: 0.00000
title: Mulliken charges with hydrogens summed into heavy atoms:
elementType: S F F F F F F N C C C C C C C C C C C C C C C C C C C C
charge: 0.221214 -0.166287 -0.163975 -0.164699 -0.166971 -0.162795 -0.166152 -0.092868 0.059245 0.030291 0.371082 0.364695 -0.048903 -0.009543 -0.178261 -0.163168 0.293412 -0.135174 -0.075381 -0.137456 0.291057 -0.092172 -0.086908 -0.077829 0.011538 0.242666 0.250254 -0.046913
polarizability: 3.61477562e+02 1.65810355e+00 3.29442517e+02 1.89401975e+01 8.34880922e+00 1.17108659e+02
1716.lowfreq: -4.0546 -2.4153 -0.0018 -0.0015 -0.0014 3.7840 6.4807 10.5911 13.9629
frequency: 6.1795 10.4426 13.9512 29.7539 35.7697 39.8797 46.4979 74.4827 84.5642 118.0388 123.1889 127.7155 156.5332 175.4569 193.1798 211.1135 216.4838 219.9742 235.5610 250.0438 301.6937 304.0374 330.1777 350.1997 357.7657 366.2656 372.4538 403.0813 414.7182 426.5178 443.4338 455.5556 462.7045 510.2741 522.5904 542.0342 558.4518 562.0259 604.8966 608.9194 616.7318 630.4683 639.2203 666.1224 668.1159 700.8807 707.0149 720.5638 737.4377 752.7557 795.1287 814.0920 841.9053 849.9670 854.5484 874.1121 879.4621 929.3832 952.4733 956.1695 967.3151 968.3207 980.3677 988.3318 989.6174 991.0503 991.5216 991.8013 1001.2357 1016.6717 1021.2804 1025.0972 1034.5720 1061.5769 1106.3257 1119.7052 1123.4703 1135.9764 1191.9530 1199.4150 1230.7204 1278.3576 1283.0493 1300.9715 1306.1433 1314.6131 1324.9261 1346.9082 1356.6411 1378.9222 1397.7431 1401.0995 1417.8383 1446.0811 1454.8674 1462.4163 1482.1988 1510.0247 1535.7075 1561.3414 1582.3105 1597.8005 1618.0637 1624.7773 3010.8760 3130.5522 3138.7333 3140.9220 3144.6616 3156.1439 3161.0695 3161.3075 3168.1629 3174.2657 3176.2124 3177.8815 3181.5321
redmass: 17.8009 13.3383 8.2472 8.5511 4.0251 6.3395 4.4332 7.6474 5.7549 6.0890 8.7583 5.8767 6.8546 3.6201 5.9386 3.0573 3.8314 5.9281 1.9729 5.4459 6.6589 7.1255 8.8992 7.0268 8.2387 9.4050 8.3872 2.8933 6.9861 4.5094 7.4782 7.0151 6.1101 11.3269 9.3520 5.6606 4.8364 5.3417 4.9299 8.5568 11.1544 7.2561 7.7317 4.9656 6.5469 1.9000 9.1890 9.0573 3.1880 3.1850 8.3158 1.5978 1.4762 5.6685 1.5480 1.6794 1.5221 1.4202 2.0582 3.6496 1.5265 1.1869 5.8101 5.7838 4.5482 1.5069 1.4404 3.2329 1.6269 6.2782 5.5049 8.0525 3.5834 2.4357 1.6357 1.9252 2.0751 1.5459 1.1001 1.1344 1.8519 2.6147 4.1807 1.5012 1.5901 3.7136 2.7694 1.2218 3.9161 4.0393 4.4067 6.6442 3.3040 3.2485 1.0532 1.1030 2.7183 2.8347 8.6961 4.7494 7.5107 6.0694 6.5415 6.3109 1.0291 1.1065 1.1021 1.0872 1.0881 1.0925 1.0892 1.0913 1.0962 1.0971 1.0908 1.0937 1.0965
irintensity: 0.1287 0.0982 0.1544 0.1285 0.0425 0.4612 2.8610 0.5997 1.0923 0.4041 1.0307 0.1471 0.2128 2.5827 0.6577 0.4422 1.5289 1.0579 0.8429 2.3809 0.5522 1.2986 4.0990 2.5543 2.6080 4.8757 7.3964 0.3008 8.5517 1.7457 7.4070 0.9895 0.9966 1.6393 0.1502 1.3083 3.9184 8.6403 29.5329 11.5219 1.9379 4.7296 16.0371 1.3182 1.9409 30.8916 0.8233 47.0951 0.7059 4.9099 36.3047 59.4134 40.3587 23.9090 52.7690 5.6157 26.1587 8.2246 47.2844 19.4014 38.6414 4.9023 205.8608 65.4342 86.8624 12.2320 2.6351 141.1703 23.6775 165.6453 25.6434 297.7876 52.8675 7.8461 10.2311 4.2172 18.5540 12.9245 11.1555 0.4881 124.8740 110.1231 519.1903 26.9674 2.7886 6.5950 66.6012 1.2915 14.8319 24.5184 37.4495 10.0770 7.7537 49.8945 18.0205 30.1335 13.1761 7.7979 160.1481 266.5049 4.2180 3.1866 7.1908 35.4807 16.8357 14.2119 5.7315 8.1544 8.6183 3.9933 0.7509 3.9381 4.0150 5.6108 3.9709 8.3669 1.4221
temp: 298.150 k
press: 1.00000 atm
elementType: 16 9 9 9 9 9 9 7 6 6 6 6 6 6 6 6 6 6 6 6 6 6 6 6 6 6 6 6 1 1 1 1 1 1 1 1 1 1 1 1 1
symmnumber: 1
zpe: 735073.0 jmol-1
zpe.correction: 0.279975 hartree
zpe.thermalcorrener: 0.305249 hartree
zpe.thermalcorrenthalpy: 0.306193 hartree
zpe.thermalcorrgfe: 0.218272 hartree
zpe.sumelectzpe: -1819.853798 hartree
zpe.sumelectthermal: -1819.828524 hartree
zpe.sumelectthermalent: -1819.827579 hartree
zpe.sumelectthermalfe: -1819.915501 hartree
dipole: -1.6758 8.4077 -0.5237
dipole: 8.5891
quadrupole: -174.8722 -161.4800 -173.2062
quadrupole: 8.8092 9.2524 4.1557
quadrupole: -5.0194 8.3728 -3.3533 8.8092 9.2524 4.1557
hfenergy: -1820.1337728 hartree
pointgroup: C01 [X(C20H13F6N1S1)]
dipole: 0.7932916 -3.250573 -0.4728258 debye
polarizability: 362.5421999|2.9546319|329.0209694|7.2221772|14.0987727|116.4655683 unknown
InChI: InChI=1S/C20H13F6NS/c1-28-16-10-17(12-5-7-14(8-6-12)19(21,22)23)27-18(11-16)13-3-2-4-15(9-13)20(24,25)26/h2-11H,1H3
charge 0 multiplicity 1
41 atoms
S  0.663301 -5.340672 -0.35583
F  4.8516 3.858241 0.47718
F  2.613429 3.577063 0.750236
F  4.032863 3.127559 2.456613
F  -6.475107 1.477823 0.477116
F  -5.239429 3.249584 -0.231541
F  -6.09301 1.783677 -1.732461
N  0.527649 -0.698739 -0.107846
C  1.709795 -1.392222 -0.074122
C  -0.646544 -1.390126 -0.215145
C  2.952225 -0.571375 0.047595
C  -1.895098 -0.570188 -0.251193
C  1.747594 -2.806701 -0.132634
C  -0.681764 -2.807724 -0.310006
C  2.844513 0.784425 0.448661
C  0.533476 -3.525368 -0.261236
C  3.998136 1.584125 0.569826
C  -3.175367 -1.13179 0.005265
C  -1.808497 0.818131 -0.540829
C  4.241169 -1.097466 -0.233141
C  -4.230537 1.04086 -0.346563
C  -4.335339 -0.336859 -0.042643
C  -2.963422 1.619022 -0.59403
C  5.282122 1.05506 0.295235
C  5.39241 -0.290764 -0.110822
C  3.872293 3.004086 1.04468
C  -5.475208 1.872421 -0.44842
C  -1.131338 -5.879564 -0.472432
H  2.695822 -3.346744 -0.062381
H  -1.634789 -3.323823 -0.441206
H  1.848903 1.188764 0.649063
H  -3.276375 -2.188262 0.272826
H  -0.819592 1.247451 -0.720964
H  4.355735 -2.131474 -0.57433
H  -5.314186 -0.776822 0.17142
H  -2.883929 2.686951 -0.818092
H  6.170876 1.687236 0.383387
H  6.377429 -0.709013 -0.340578
H  -1.597088 -5.492451 -1.391738
H  -1.690781 -5.563085 0.421415
H  -1.098039 -6.978846 -0.514035
