program: Gaussian 09
title: 000191011
version: EM64L-G09RevD.01
frameworkgroup: C1[X(C11H11NO6)]
method: RPBEPBE
basis: SDD
operation: Freq
keyword: #p
keyword: freq=noraman
keyword: PBEPBE/SDD
title: #p freq=noraman PBEPBE/SDD
converged: YES YES NO NO
title: Mulliken charges:
elementType: O O O O O O N C C C C C C C C C C C H H H H H H H H H H H
charge: -0.468217 -0.299922 -0.425577 -0.394509 -0.248086 -0.254685 -0.398293 -0.523878 0.203231 -0.126438 0.199589 0.281353 -0.501330 -0.321800 0.274202 -0.349145 0.143829 -0.079656 0.244457 0.284336 0.279029 0.239127 0.316572 0.262803 0.366507 0.367324 0.180084 0.357231 0.391864
chargesum: 0.00000
title: Mulliken charges with hydrogens summed into heavy atoms:
elementType: O O O O O O N C C C C C C C C C C C
charge: -0.100893 -0.299922 -0.068347 -0.002645 -0.248086 -0.254685 -0.031786 0.004915 0.203231 0.152591 0.199589 0.281353 -0.262203 -0.005228 0.274202 -0.086342 0.143829 0.100427
polarizability: 2.07776051e+02 -9.68322230e+00 1.81315051e+02 1.45380685e+01 1.73297571e+00 8.43758241e+01
1716.lowfreq: 0.0003 0.0006 0.0008 1.2911 4.7655 6.3215 22.5902 30.6997 44.3033
frequency: 22.5520 30.6899 44.3003 68.5115 91.0682 96.4219 148.8829 156.1889 169.1388 200.2945 240.0955 260.7321 271.4421 287.4246 328.1178 345.2494 376.0120 401.9053 407.5348 411.7200 423.3640 443.6979 463.0606 484.3315 526.7255 568.5740 602.7832 617.8924 664.0473 690.9305 721.5115 733.1826 738.5033 809.9585 839.7406 843.2621 862.5142 906.1565 933.1277 956.1441 973.8578 991.2549 999.4891 1020.9202 1070.0799 1075.4820 1108.2204 1125.0012 1145.3559 1181.1927 1214.4263 1234.0702 1248.5851 1276.0135 1279.7693 1299.1639 1306.4706 1340.2534 1381.8292 1388.9490 1394.8454 1418.9841 1440.7867 1451.9795 1526.1494 1564.0550 1592.3333 1626.5894 1632.0027 1638.9907 2954.3327 2958.7319 2999.2413 3070.2204 3138.8755 3167.9638 3176.3372 3189.5607 3499.2215 3508.2034 3581.3148
redmass: 7.9015 7.1414 9.7208 6.9713 4.9184 7.2582 7.1891 5.2704 6.2405 4.0821 7.7737 5.3143 3.2170 2.4798 6.1364 1.1441 1.7166 4.5483 3.5629 3.6519 4.1130 7.9026 4.6626 5.0263 2.9536 3.5022 2.5402 1.6647 7.0012 3.7242 5.2713 3.6590 5.9956 2.8162 3.3504 2.5226 1.4542 5.5636 1.3189 2.9077 1.3036 3.5515 1.3095 4.6905 2.3757 2.7194 3.0539 1.7061 1.3818 1.1419 1.6292 1.5764 1.2295 1.3405 2.0400 1.7258 2.4526 2.1155 1.5124 1.9805 2.8232 2.6595 1.2840 2.8908 3.3196 4.0678 4.8254 6.4413 3.0149 9.1768 1.0868 1.0804 1.0631 1.0970 1.0903 1.0904 1.0832 1.0968 1.0651 1.0642 1.0662
irintensity: 1.5287 0.9026 0.7501 0.4674 0.4605 4.1807 8.3144 4.2257 3.2543 4.7145 3.8449 17.7338 11.2751 46.3360 3.6091 146.4720 98.2140 13.1607 16.1450 19.3571 0.9815 8.9148 20.1203 11.1176 9.6935 43.3457 14.3722 112.5611 10.2983 32.7175 24.5072 0.9974 13.1502 23.1233 26.5574 12.5869 39.3391 32.4502 57.4701 29.9292 27.8870 24.3708 2.5568 201.5365 92.9277 9.9113 30.2445 211.7836 65.3177 13.8718 201.0006 5.5803 43.7928 0.0181 51.0895 49.4206 199.9336 100.8885 44.1465 30.8510 47.8175 56.7532 61.6291 67.0886 484.9299 138.9518 395.3782 9.5927 21.9274 277.5106 96.5739 15.7796 12.1367 5.1462 9.9456 7.3450 217.9931 8.7106 30.4340 29.3157 46.0122
temp: 298.150 k
press: 1.00000 atm
elementType: 8 8 8 8 8 8 7 6 6 6 6 6 6 6 6 6 6 6 1 1 1 1 1 1 1 1 1 1 1
symmnumber: 1
zpe: 552548.5 jmol-1
zpe.correction: 0.210455 hartree
zpe.thermalcorrener: 0.227656 hartree
zpe.thermalcorrenthalpy: 0.228600 hartree
zpe.thermalcorrgfe: 0.163754 hartree
zpe.sumelectzpe: -930.552075 hartree
zpe.sumelectthermal: -930.534873 hartree
zpe.sumelectthermalent: -930.533929 hartree
zpe.sumelectthermalfe: -930.598775 hartree
dipole: -2.5591 2.1540 1.2600
dipole: 3.5744
quadrupole: -130.6122 -97.5882 -102.9355
quadrupole: 8.2491 -6.4619 -0.3327
quadrupole: -20.2336 12.7904 7.4432 8.2491 -6.4619 -0.3327
hfenergy: -930.7625291 hartree
pointgroup: C01 [X(C11H11N1O6)]
dipole: 1.0676448 0.9042096 -0.141838 debye
polarizability: 205.8718245|1.0967053|172.0650417|24.4347047|27.1059732|95.5300603 unknown
InChI: InChI=1S/C11H11NO6/c13-5-12-8-2-1-6(14)3-7(8)9(15)4-10(16)11(17)18/h1-3,5,10,12,14,16-17H,4H2
charge 0 multiplicity 1
29 atoms
O  4.083407 -0.013101 1.700422
O  0.731609 -1.699438 0.124907
O  -2.095657 3.733249 0.676889
O  2.999897 -0.386588 -1.775904
O  5.123125 -0.276941 -0.832674
O  -3.988747 -2.280442 -1.315357
N  -1.787178 -1.774194 -0.582139
C  1.877394 0.34106 0.763186
C  -0.659374 0.278089 0.178744
C  3.178068 -0.474283 0.652137
C  0.632298 -0.436108 0.325642
C  -1.851135 -0.397646 -0.279254
C  -0.742716 1.666738 0.501174
C  -3.064455 0.339774 -0.415007
C  -1.950665 2.370428 0.370831
C  -3.111751 1.702298 -0.094695
C  3.87905 -0.360446 -0.703509
C  -2.79638 -2.604661 -1.056317
H  1.964111 1.289447 0.206133
H  1.772879 0.606722 1.833978
H  2.928189 -1.549284 0.784493
H  0.147222 2.19141 0.865849
H  -3.95409 -0.183015 -0.770965
H  -4.041515 2.270263 -0.193978
H  -0.843324 -2.182475 -0.408286
H  5.01802 -0.134665 1.380059
H  -2.421809 -3.643789 -1.190756
H  -1.245671 4.125138 0.997319
H  3.503497 -0.368542 -2.63492
