program: Gaussian 09
title: 000191020
version: EM64L-G09RevD.01
frameworkgroup: C1[X(C15H10F5N3O2)]
method: RPBEPBE
basis: SDD
operation: Freq
keyword: #p
keyword: freq=noraman
keyword: PBEPBE/SDD
title: #p freq=noraman PBEPBE/SDD
converged: YES YES NO NO
title: Mulliken charges:
elementType: F F F F F O O N N N C C C C C C C C C C C C C C C H H H H H H H H H H
charge: -0.156434 -0.127840 -0.140440 -0.141889 -0.139793 -0.198481 -0.227364 -0.159565 -0.202243 -0.079001 -0.180297 -0.472702 -0.472753 -0.343894 0.292960 0.166008 0.052842 -0.134487 0.179931 0.118876 -0.157794 0.052496 0.058608 -0.317786 0.123717 0.296706 0.246163 0.251606 0.257040 0.242819 0.252048 0.248518 0.258472 0.292578 0.261372
chargesum: 0.00000
title: Mulliken charges with hydrogens summed into heavy atoms:
elementType: F F F F F O O N N N C C C C C C C C C C C C C C C
charge: -0.156434 -0.127840 -0.140440 -0.141889 -0.139793 -0.198481 -0.227364 -0.159565 -0.202243 -0.079001 0.116409 0.025067 0.027106 0.156672 0.292960 0.166008 0.052842 0.123986 0.179931 0.118876 0.134785 0.052496 0.058608 -0.056414 0.123717
polarizability: 2.58955170e+02 -6.16944285e+00 1.73279874e+02 -1.96364779e+01 -1.01839643e+01 1.29700557e+02
1716.lowfreq: -7.8574 -2.6897 -0.0011 -0.0010 -0.0010 3.9885 19.0794 21.2321 28.8443
frequency: 18.7097 21.1502 28.7990 43.7606 53.4802 71.1209 101.2755 119.6920 129.0578 134.0017 150.2994 160.4428 165.7075 178.3708 206.3572 240.2101 255.8496 258.8914 271.4825 284.5436 290.6445 324.8656 347.5783 363.7404 372.4309 405.6341 423.2755 474.1000 498.7411 533.1848 544.4073 570.1274 599.4860 604.2151 634.1555 640.1441 670.6268 694.8601 701.4486 714.1106 742.4707 776.2855 776.7254 818.5621 843.7511 863.5040 867.3873 869.0038 881.1134 914.2083 921.6641 927.7850 953.3000 985.7155 1006.2338 1046.2908 1061.4354 1068.2860 1071.4753 1096.5454 1107.7327 1153.1130 1166.7615 1184.4980 1205.6228 1223.4135 1228.4443 1239.6495 1251.0332 1266.4332 1306.7412 1329.5947 1331.7458 1335.0404 1364.3368 1364.5791 1374.6302 1391.3756 1441.9205 1442.5325 1463.3673 1469.5742 1472.5481 1487.4094 1492.6122 1579.3914 1600.7990 1620.9283 1635.6854 2998.8945 3019.3740 3033.4465 3058.6674 3068.6018 3088.7588 3106.2968 3234.6809 3259.2896 3269.0423
redmass: 7.5288 9.5477 6.9364 5.6537 8.5534 4.8587 4.7403 14.2570 5.9309 6.8022 6.7758 5.9122 12.9272 4.5236 12.5517 3.4908 18.7742 8.0505 4.2918 11.9149 8.0876 12.5675 7.2049 7.8714 12.0327 9.7120 15.9417 14.6936 6.1531 6.5809 16.9592 2.4385 3.0598 9.8689 12.1647 3.4473 9.5637 5.4245 5.8354 1.2776 5.8116 8.7646 8.4506 1.4472 4.8378 1.4570 5.8377 2.2246 2.1688 2.2953 7.3793 3.5350 4.4554 2.3134 2.3670 3.5474 3.8439 4.8071 3.1331 1.8111 1.6381 1.5056 1.7009 2.3195 1.7970 3.6096 4.1703 1.6058 1.6310 1.9115 1.3157 1.6780 1.5683 1.4697 11.5793 5.7756 2.5606 7.6315 11.1472 3.9687 11.8669 1.0876 1.0992 1.1147 4.2628 11.5595 11.9980 12.0201 10.2744 1.0606 1.0628 1.0627 1.0856 1.1028 1.1026 1.1064 1.0923 1.0981 1.1091
irintensity: 0.3140 0.7624 2.0744 1.4658 1.3780 1.4948 1.2416 0.0239 0.7850 0.3515 2.2311 1.8589 0.1206 4.4388 3.1668 5.9632 0.0735 1.5416 0.8294 1.0087 7.2891 10.2480 0.4299 11.3988 0.3868 5.6120 0.6317 0.5088 2.3159 10.5549 1.3534 1.5044 4.8586 3.0004 0.4007 18.9739 7.3518 61.7431 5.9558 40.2925 5.0349 23.7912 13.9477 40.2282 0.7148 2.6688 12.8461 11.2408 38.7825 9.1732 108.7999 56.4723 27.6181 36.4445 32.4956 8.6181 19.4966 3.5660 18.5046 8.8234 75.6662 8.1564 2.6620 66.9748 147.2245 1.3607 98.4689 6.5229 124.9142 85.2478 8.9045 3.0944 3.6191 9.2536 0.7634 21.4032 198.7228 335.7517 233.2957 90.1977 54.2773 9.4515 19.4286 8.3254 8.3190 270.0445 27.0537 43.7622 143.8797 29.4662 15.5424 18.8364 11.5044 10.0548 13.5211 26.5835 2.6775 2.1772 3.3073
temp: 298.150 k
press: 1.00000 atm
elementType: 9 9 9 9 9 8 8 7 7 7 6 6 6 6 6 6 6 6 6 6 6 6 6 6 6 1 1 1 1 1 1 1 1 1 1
symmnumber: 1
zpe: 612854.6 jmol-1
zpe.correction: 0.233424 hartree
zpe.thermalcorrener: 0.255477 hartree
zpe.thermalcorrenthalpy: 0.256421 hartree
zpe.thermalcorrgfe: 0.179381 hartree
zpe.sumelectzpe: -1389.667447 hartree
zpe.sumelectthermal: -1389.645394 hartree
zpe.sumelectthermalent: -1389.644450 hartree
zpe.sumelectthermalfe: -1389.721490 hartree
dipole: 0.6265 6.4855 1.7151
dipole: 6.7377
quadrupole: -164.2155 -145.3888 -138.8589
quadrupole: 18.2351 -3.4367 2.8871
quadrupole: -14.7278 4.0989 10.6289 18.2351 -3.4367 2.8871
hfenergy: -1389.9008712 hartree
pointgroup: C01 [X(C15H10F5N3O2)]
dipole: 0.1834356 2.2800033 1.3396726 debye
polarizability: 259.4702124|0.9826178|175.4086897|-18.8763713|2.2013746|127.0566995 unknown
InChI: InChI=1S/C15H10F5N3O2/c16-9-8(10(17)12(19)13(20)11(9)18)15(25)23-4-1-2-7(23)14(24)22-5-3-21-6-22/h3,5-7H,1-2,4H2
charge 0 multiplicity 1
35 atoms
F  -2.124563 2.326993 -0.389093
F  -1.415433 -2.465556 -0.216733
F  -4.1574 -2.863794 -0.113618
F  -4.868593 1.921357 -0.281454
F  -5.893177 -0.678105 -0.154708
O  2.270726 -1.24947 1.144079
O  0.344165 -0.288229 -1.578542
N  0.471291 0.799613 0.465426
N  3.988178 -0.341696 -0.142455
N  6.01778 -1.219398 -0.680158
C  1.918143 1.032834 0.29194
C  2.251673 2.018571 1.452922
C  1.26095 1.593192 2.567548
C  -0.035175 1.2478 1.793857
C  2.696026 -0.291611 0.459101
C  -0.214913 0.137143 -0.521706
C  -1.707004 -0.061132 -0.309959
C  4.659692 0.631491 -0.928457
C  -2.612529 1.018169 -0.314972
C  -2.254711 -1.360767 -0.245147
C  4.873363 -1.442474 -0.031045
C  -3.645744 -1.577189 -0.189419
C  -4.006643 0.83333 -0.267211
C  5.890307 0.07755 -1.24183
C  -4.523685 -0.475141 -0.203747
H  2.107554 1.455062 -0.708451
H  2.043642 3.050626 1.117693
H  3.306785 1.964117 1.768137
H  1.637003 0.696404 3.088196
H  1.095551 2.388281 3.312577
H  -0.61365 0.445041 2.281856
H  -0.681745 2.136947 1.673519
H  4.219047 1.586869 -1.194039
H  4.599623 -2.337247 0.520316
H  6.693167 0.510121 -1.833823
