program: Gaussian 09
title: 000190988
version: EM64L-G09RevD.01
frameworkgroup: C1[X(C9H13N3O3)]
method: RPBEPBE
basis: SDD
operation: Freq
keyword: #p
keyword: freq=noraman
keyword: PBEPBE/SDD
title: #p freq=noraman PBEPBE/SDD
converged: YES YES NO NO
title: Mulliken charges:
elementType: O O O N N N C C C C C C C C C H H H H H H H H H H H H H
charge: -0.300292 -0.440589 -0.270836 -0.232273 -0.047909 -0.623263 -0.437364 0.043042 -0.423959 -0.067564 -0.373691 -0.089703 0.043114 -0.353486 0.186867 0.258055 0.209261 0.274901 0.205189 0.247891 0.227240 0.199539 0.251670 0.287492 0.339551 0.230252 0.339750 0.317113
chargesum: 0.00000
title: Mulliken charges with hydrogens summed into heavy atoms:
elementType: O O O N N N C C C C C C C C C
charge: -0.300292 -0.101037 -0.270836 -0.232273 -0.047909 0.033599 0.046799 0.301097 0.029122 0.159676 0.077518 0.197789 0.043114 -0.123234 0.186867
polarizability: 1.81719493e+02 -1.45480344e+01 1.25693957e+02 -9.17052362e+00 4.60434456e+00 7.98504176e+01
1716.lowfreq: -17.0870 -10.6784 -0.0001 -0.0001 0.0002 6.1071 38.1649 52.2386 73.1734
frequency: 38.0901 52.1070 73.1378 131.9193 145.3183 203.4226 205.9255 238.6149 275.6123 343.3127 352.8587 365.1026 383.8149 401.6517 425.0300 430.2933 474.3990 489.3719 533.0999 566.0004 567.6556 591.4229 691.9993 694.6242 733.1768 745.5379 770.5238 784.5240 814.6631 824.2583 874.1450 903.7886 919.4138 937.6043 952.2969 989.6280 1005.4627 1022.2859 1044.9872 1071.2133 1098.8797 1101.0069 1170.8889 1180.3932 1193.1684 1199.1336 1209.8638 1260.2279 1290.1748 1300.0770 1306.7630 1323.2540 1338.7225 1347.4195 1357.5916 1367.2406 1388.9890 1447.3853 1455.0520 1462.1131 1475.3634 1506.5744 1590.1817 1628.8915 1642.8307 2972.3968 2986.4862 2989.4797 3001.6815 3055.2395 3069.9481 3078.2240 3100.5846 3173.2544 3196.3355 3540.4017 3542.7201 3700.8055
redmass: 4.5795 5.3373 4.7653 5.2357 4.9259 3.8757 4.2906 5.4102 4.3515 3.1285 2.7094 1.4665 2.3004 2.2011 1.2687 2.5921 2.5437 5.3474 5.2158 3.1872 1.5817 5.5784 3.0028 2.8087 6.8644 5.7977 1.9114 4.1234 2.2348 3.2930 2.3423 3.0595 3.3243 3.3788 1.3490 2.2131 2.9652 2.2040 2.2545 1.9591 1.6109 2.2290 1.3250 2.1957 1.3650 1.3370 3.0657 1.5254 1.5866 1.5613 1.2774 1.4158 1.5009 1.6973 1.3785 1.1697 1.6732 1.0848 1.0892 1.0968 4.6035 4.6402 2.3084 2.0730 8.2180 1.0665 1.0788 1.0663 1.0683 1.0871 1.0965 1.1005 1.0983 1.0891 1.0999 1.0654 1.0452 1.1045
irintensity: 7.1569 2.5025 6.0845 5.8580 3.5884 2.5055 4.1504 2.5958 20.8336 8.2016 15.0050 47.3597 40.2713 4.3642 105.9978 53.4446 3.3401 22.5577 1.5353 41.8088 97.2777 10.8999 0.6346 1.6089 3.1196 6.5166 78.8965 13.4610 15.3087 7.0763 1.4982 35.4364 33.3400 57.8204 0.5918 45.5452 99.7860 7.9218 21.3187 34.2862 40.3154 19.5945 23.7663 36.3948 67.8478 21.8456 14.6757 37.4372 71.9117 0.2497 16.0558 4.4766 22.4918 59.5139 3.7733 30.0078 26.4128 10.8009 12.1307 15.5631 164.9611 102.4693 141.7789 265.8385 738.2705 44.1483 2.2609 25.1526 32.9527 48.7097 21.2261 11.7894 19.2343 1.2379 5.2767 2.2986 108.8830 38.0646
temp: 298.150 k
press: 1.00000 atm
elementType: 8 8 8 7 7 7 6 6 6 6 6 6 6 6 6 1 1 1 1 1 1 1 1 1 1 1 1 1
symmnumber: 1
zpe: 586876.2 jmol-1
zpe.correction: 0.223529 hartree
zpe.thermalcorrener: 0.237138 hartree
zpe.thermalcorrenthalpy: 0.238082 hartree
zpe.thermalcorrgfe: 0.183046 hartree
zpe.sumelectzpe: -739.545558 hartree
zpe.sumelectthermal: -739.531949 hartree
zpe.sumelectthermalent: -739.531005 hartree
zpe.sumelectthermalfe: -739.586041 hartree
dipole: 0.9056 -4.2977 -0.0791
dipole: 4.3928
quadrupole: -72.6113 -94.8001 -89.4281
quadrupole: -22.1599 -10.2083 -0.6328
quadrupole: 13.0019 -9.1870 -3.8149 -22.1599 -10.2083 -0.6328
hfenergy: -739.7690871 hartree
pointgroup: C01 [X(C9H13N3O3)]
dipole: -0.3189234 -1.6918785 -0.1508752 debye
polarizability: 180.9119525|16.6982199|126.874432|-8.0703357|0.1918521|79.4774827 unknown
InChI: InChI=1S/C9H13N3O3/c10-7-3-4-12(9(14)11-7)8-2-1-6(13)5-15-8/h3-4,6,8,13H,1-2,5,10H2
charge 0 multiplicity 1
28 atoms
O  1.522704 -0.743889 -0.918575
O  3.868796 -1.280206 0.826599
O  -1.095635 2.290506 -0.036783
N  -0.581166 0.006666 -0.133763
N  -2.875167 0.755232 0.12627
N  -4.595338 -0.789573 0.308004
C  1.510735 0.754978 1.050453
C  0.836449 0.397895 -0.288903
C  3.008433 1.069489 0.810511
C  3.708299 -0.059379 0.016332
C  2.917402 -0.379288 -1.266337
C  -0.977293 -1.310436 -0.095121
C  -1.544526 1.106886 -0.011216
C  -2.310883 -1.641121 0.061934
C  -3.248117 -0.543984 0.167047
H  0.857787 1.278886 -0.963141
H  1.396089 -0.096427 1.749629
H  0.99359 1.624975 1.489552
H  3.10086 2.019216 0.245278
H  3.528912 1.208718 1.773666
H  4.740894 0.232513 -0.243243
H  2.912213 0.484224 -1.963847
H  3.324305 -1.26934 -1.771497
H  -0.188347 -2.054492 -0.220959
H  2.978776 -1.714004 0.893849
H  -2.627304 -2.685611 0.084566
H  -5.219154 0.013431 0.371744
H  -4.970216 -1.733167 0.343147
