program: Gaussian 09
title: 000189386
version: EM64L-G09RevD.01
frameworkgroup: C1[X(C20H13FO2)]
method: RPBEPBE
basis: SDD
operation: Freq
keyword: #p
keyword: freq=noraman
keyword: PBEPBE/SDD
title: #p freq=noraman PBEPBE/SDD
converged: YES YES NO NO
title: Mulliken charges:
elementType: F O O C C C C C C C C C C C C C C C C C C C C H H H H H H H H H H H H H
charge: -0.203406 -0.430910 -0.428249 -0.371705 0.268746 0.372581 0.232102 -0.291861 0.252579 0.278217 -0.179888 -0.440351 -0.621820 -0.410764 -0.680449 -0.421946 0.195556 0.518364 -0.221855 0.168307 -0.481098 -0.395899 -0.201466 0.267652 0.260128 0.269532 0.283805 0.258336 0.250586 0.249868 0.228297 0.342586 0.344812 0.246562 0.258360 0.234691
chargesum: 0.00000
title: Mulliken charges with hydrogens summed into heavy atoms:
elementType: F O O C C C C C C C C C C C C C C C C C C C C
charge: -0.203406 -0.088325 -0.083437 -0.371705 0.268746 0.372581 0.232102 -0.024209 0.252579 0.278217 0.080240 -0.170819 -0.338015 -0.160178 -0.422113 -0.172078 0.195556 0.518364 0.006442 0.168307 -0.234535 -0.137539 0.033225
polarizability: 4.14138909e+02 6.43771978e+00 2.48082357e+02 3.18170211e+00 -5.50592752e+00 1.04417621e+02
1716.lowfreq: -3.6123 -0.0006 -0.0005 -0.0004 5.1157 7.0774 47.2585 52.9462 69.7106
frequency: 47.2553 52.9351 69.7099 105.5173 111.1040 154.1235 170.1033 188.2033 216.3365 221.8546 269.6522 277.2807 296.9640 306.3467 322.9912 336.3982 385.6331 421.8907 433.4831 439.9423 457.2688 479.8923 489.0988 503.1422 540.5842 544.3081 559.6192 579.1105 583.9091 605.3882 631.6551 663.0183 677.6371 701.4607 740.5457 766.3235 772.4955 783.0439 803.5101 821.9067 833.3421 848.4641 859.7170 879.1819 884.5249 915.5894 920.4672 920.5609 927.3897 931.5803 937.1392 972.0641 983.0550 1004.5060 1035.7757 1061.3069 1066.3298 1094.4671 1139.9698 1169.4151 1178.5516 1183.8455 1192.4974 1210.9166 1216.5692 1223.5175 1237.9762 1252.2185 1264.8569 1280.6539 1314.9652 1332.2598 1344.1517 1353.5255 1363.6066 1390.9054 1393.2217 1413.4539 1432.5590 1451.8525 1468.4450 1480.0572 1504.5818 1583.2205 1604.9740 1618.0280 1625.1781 1644.9830 1656.2585 3068.4402 3072.6671 3129.7408 3132.2354 3135.1727 3142.5175 3144.6483 3157.6926 3158.6028 3160.7763 3181.9598 3538.6861 3544.1188
redmass: 6.4020 6.3842 5.8679 5.5867 7.1897 4.8188 5.1120 5.5161 5.1048 8.7855 3.9535 1.5759 4.5820 2.2841 1.1205 6.2226 4.6187 4.3735 4.3544 4.5541 5.4040 7.3101 5.1496 5.1051 4.2268 6.3648 4.8307 4.5108 5.0123 4.7294 4.2472 5.4766 5.0743 6.9444 2.0616 1.8061 4.4779 3.4020 1.9529 2.3730 5.2595 4.3887 2.3519 1.4989 2.2492 1.9336 4.0270 2.6693 1.6998 1.7097 3.9332 1.3618 1.3730 4.6621 2.6424 1.9988 2.5074 2.7253 2.2655 1.2217 1.2307 1.3703 1.2924 1.5987 1.3970 1.8485 2.7309 1.4735 2.7916 3.3361 2.3712 1.4946 1.4538 1.1643 1.5231 5.7045 2.2922 6.9701 2.9874 3.9310 4.4010 3.4188 5.2595 8.0734 7.4597 8.0369 8.0230 7.7837 8.7834 1.0858 1.0857 1.0864 1.0913 1.0882 1.0922 1.0930 1.0924 1.0939 1.0986 1.0969 1.0665 1.0664
irintensity: 0.0865 0.0898 0.5121 4.6724 0.1769 1.4398 0.8166 0.2140 1.8270 2.2966 1.2328 36.0111 0.5585 38.5861 116.3826 15.6104 7.4178 2.2063 0.5963 2.7360 0.6189 3.1437 6.5901 0.4313 0.3218 0.3647 6.7118 3.5772 0.6266 3.8665 0.5234 3.3683 12.9851 7.9493 36.9919 2.2202 3.6967 32.0245 9.8811 77.8757 14.7192 10.7606 11.8682 0.1222 34.3166 4.7826 106.5863 7.3327 37.6583 3.5068 38.7865 5.8056 0.5193 24.6387 8.2057 10.2692 7.0184 8.2793 5.7481 1.7697 48.6775 10.7423 39.0203 28.8282 21.7949 33.6715 3.2648 2.4839 11.5654 6.4874 26.4482 10.2545 28.9877 67.4963 26.2829 5.3062 5.8868 0.2857 5.7097 29.2773 41.7890 1.1707 8.6966 17.2987 5.7706 0.6192 10.6315 37.7215 0.9825 10.4963 16.3685 1.9652 1.8519 5.6066 9.7960 5.8388 0.5003 22.6847 31.8669 7.1947 14.9030 11.6331
temp: 298.150 k
press: 1.00000 atm
elementType: 9 8 8 6 6 6 6 6 6 6 6 6 6 6 6 6 6 6 6 6 6 6 6 1 1 1 1 1 1 1 1 1 1 1 1 1
symmnumber: 1
zpe: 709993.1 jmol-1
zpe.correction: 0.270422 hartree
zpe.thermalcorrener: 0.287902 hartree
zpe.thermalcorrenthalpy: 0.288847 hartree
zpe.thermalcorrgfe: 0.225679 hartree
zpe.sumelectzpe: -1018.669416 hartree
zpe.sumelectthermal: -1018.651935 hartree
zpe.sumelectthermalent: -1018.650991 hartree
zpe.sumelectthermalfe: -1018.714159 hartree
dipole: 2.6299 3.8050 -0.2325
dipole: 4.6313
quadrupole: -132.2016 -125.4655 -136.0664
quadrupole: -2.8260 1.5623 -3.3531
quadrupole: -0.9571 5.7790 -4.8219 -2.8260 1.5623 -3.3531
hfenergy: -1018.9398378 hartree
pointgroup: C01 [X(C20H13F1O2)]
dipole: 1.0160461 1.5055704 -0.1446154 debye
polarizability: 413.9643139|8.561458|247.7225353|2.4968586|-10.387319|104.9520374 unknown
InChI: InChI=1S/C20H13FO2/c21-17-6-1-3-10-7-14-11-4-2-5-12-19(11)16(9-18(22)20(12)23)15(14)8-13(10)17/h1-9,18,20,22-23H
charge 0 multiplicity 1
36 atoms
F  4.029869 -2.602025 0.315375
O  -4.367554 -0.979818 1.745588
O  -3.468502 -2.583137 -1.494859
C  -1.843806 0.316617 -0.011562
C  -1.04831 -0.918121 0.091037
C  -3.244823 0.383112 0.027005
C  -1.00146 1.455568 -0.132197
C  -3.984153 -0.915829 0.309296
C  0.369088 -0.482307 0.069274
C  0.39719 0.97094 -0.079623
C  -3.183217 -2.200219 -0.080546
C  -1.673684 -2.136689 0.102413
C  1.549641 -1.212433 0.151083
C  -3.836788 1.663107 -0.106063
C  1.608849 1.651786 -0.143773
C  -1.597744 2.72811 -0.257215
C  2.804849 -0.521345 0.089126
C  2.845988 0.925016 -0.06038
C  -3.016174 2.813464 -0.250562
C  4.058996 -1.197404 0.168819
C  4.116652 1.586164 -0.120217
C  5.291162 -0.559786 0.111322
C  5.309709 0.86203 -0.03665
H  -4.952035 -0.970012 -0.216009
H  -3.625647 -3.028592 0.49683
H  -1.12923 -3.086615 0.131029
H  1.547431 -2.300619 0.263578
H  1.644152 2.741163 -0.257492
H  -4.927111 1.768813 -0.078661
H  -0.996036 3.638048 -0.355736
H  -3.491115 3.795699 -0.350972
H  -3.579412 -0.729309 2.294084
H  -2.925064 -2.003244 -2.089909
H  4.140717 2.675716 -0.232811
H  6.215091 -1.140427 0.178531
H  6.273783 1.378278 -0.083553
