program: Gaussian 09
title: 000191007
version: EM64L-G09RevD.01
frameworkgroup: C1[X(C18H36NO4)]
method: RPBEPBE
basis: SDD
operation: Freq
keyword: #p
keyword: freq=noraman
keyword: PBEPBE/SDD
title: #p freq=noraman PBEPBE/SDD
converged: YES YES NO NO
title: Mulliken charges:
elementType: O O O O N C C C C C C C C C C C C C C C C C C H H H H H H H H H H H H H H H H H H H H H H H H H H H H H H H H H H H H
charge: -0.293839 -0.241166 -0.443087 -0.185522 -0.117276 -0.369378 -0.030502 -0.540304 -0.553901 -0.563674 -0.522777 -0.371380 -0.385352 -0.378878 -0.382099 -0.398022 -0.373122 -0.528763 0.285066 -0.353545 0.225593 -0.356318 -0.692760 0.275329 0.301323 0.273040 0.272089 0.267719 0.263918 0.265449 0.278002 0.265789 0.271609 0.258011 0.306078 0.282023 0.256727 0.198105 0.205214 0.186642 0.198779 0.209875 0.186688 0.197031 0.194574 0.234241 0.237464 0.187490 0.192964 0.241558 0.250102 0.187886 0.190910 0.193339 0.196683 0.209123 0.211411 0.219724 0.404097
chargesum: 1.00000
title: Mulliken charges with hydrogens summed into heavy atoms:
elementType: O O O O N C C C C C C C C C C C C C C C C C C
charge: -0.293839 -0.241166 -0.038990 -0.185522 -0.117276 0.207273 0.242539 0.263422 0.255338 0.272025 0.015973 0.031939 0.000069 0.017685 0.009506 0.073683 0.007332 -0.037103 0.285066 0.025251 0.225593 0.033704 -0.052502
polarizability: 2.60979175e+02 -1.96578778e+00 1.92630786e+02 7.95878376e+00 -2.01320498e+00 1.86019372e+02
1716.lowfreq: -38.1160 -7.4166 -5.4157 -0.0006 0.0008 0.0014 2.2602 10.5371 11.1655
frequency: -36.3021 -5.6730 10.3233 20.3050 26.4110 39.4023 41.2761 48.0919 56.1166 65.3847 72.5735 81.8522 94.5848 107.8545 121.1052 123.7543 139.8678 143.4778 165.8060 183.5189 192.1842 218.4853 220.9442 230.3946 237.3088 262.7054 266.9054 292.5089 302.7959 349.1252 351.0141 374.8318 390.0756 405.9425 423.9744 436.4564 454.9611 462.4646 483.4208 493.0140 506.6181 533.2506 589.9854 638.6917 670.4625 688.0176 716.2060 720.0945 728.4572 733.2608 761.9963 776.1322 805.9274 814.6251 859.8553 865.1837 875.2134 888.5170 892.9162 904.7821 933.3596 940.7797 945.7961 971.1103 983.7384 996.8618 1004.1725 1007.2532 1016.2391 1035.3765 1048.3718 1050.1048 1068.2730 1072.5581 1079.2443 1081.6998 1088.1579 1093.2615 1116.5076 1119.2249 1128.4302 1156.2288 1184.0173 1195.3862 1197.7738 1211.1982 1215.3793 1218.9460 1222.5503 1247.9099 1252.4501 1256.3229 1263.3741 1274.4135 1278.3415 1286.6670 1288.7397 1290.6015 1294.5466 1297.0987 1307.5674 1309.7520 1320.0747 1331.3563 1344.9827 1353.9310 1356.2818 1357.3649 1359.9888 1389.0297 1391.3175 1424.1051 1429.1846 1431.0802 1445.2500 1446.3917 1452.3347 1457.9856 1458.7022 1461.4390 1462.8200 1463.9985 1467.1926 1467.4110 1469.3885 1472.8614 1476.2415 1478.8840 1484.4752 1486.4399 1487.7784 1490.0645 1506.3391 1642.4232 1691.6317 2944.7715 2948.7827 2950.4467 2952.5764 2957.7868 2963.4835 2968.1837 2973.0834 2983.4392 2988.4156 2995.1583 2995.9581 3003.6250 3009.8877 3013.0103 3018.0288 3020.6777 3021.6613 3024.7957 3028.8188 3030.5803 3041.0409 3049.8726 3059.8310 3068.8667 3073.5491 3093.9702 3103.7758 3125.2131 3137.4096 3140.9330 3144.8056 3146.1150 3150.3933 3152.3328 3510.8603
redmass: 1.5182 5.1286 4.4657 3.4550 3.7328 9.6506 5.1281 3.6218 2.4831 2.3725 3.6377 4.4695 3.5362 1.8603 3.4230 2.3761 2.3797 2.4992 2.3632 4.6283 1.2517 3.8511 1.1234 3.3888 2.3743 2.7952 1.3695 1.1564 2.4375 2.8163 2.3183 3.1049 3.3063 2.7567 2.5270 1.9518 2.9950 2.9988 3.2835 3.1770 2.6133 3.7783 4.1379 1.4226 2.6133 3.5371 1.0625 1.1002 2.8603 1.2972 1.2619 3.9790 2.3384 1.6200 2.8378 1.6524 2.3990 1.9077 2.2972 2.5975 2.4719 1.7825 2.2448 2.4834 2.5962 2.6478 2.2278 2.0559 1.9231 1.8692 3.0478 1.2000 2.6080 1.8040 2.4700 2.0544 2.0660 1.6676 1.4174 2.3911 1.8578 1.9823 1.7421 1.3952 1.3975 1.4168 1.4762 1.6452 1.3277 1.3361 1.8574 1.3023 1.6066 1.2323 1.0327 1.0786 1.2797 1.1603 1.0997 1.5001 1.5147 1.2024 1.3526 1.3879 1.4545 1.6879 1.6155 1.4091 1.5564 1.2156 1.3076 1.1496 1.1374 1.0926 1.1024 1.0873 1.0491 1.0761 1.0734 1.0682 1.0733 1.0713 1.1038 1.0930 1.0480 1.0811 1.0431 1.0842 1.0914 1.0510 1.0923 1.0531 1.0528 10.2611 8.9792 1.0620 1.0589 1.0591 1.0593 1.0596 1.0595 1.0592 1.0362 1.0958 1.0970 1.0824 1.0745 1.1015 1.0774 1.0621 1.1032 1.0675 1.0318 1.0326 1.0344 1.1047 1.1046 1.0606 1.1040 1.1007 1.0993 1.1015 1.0992 1.1061 1.1060 1.1055 1.1051 1.1056 1.1055 1.1059 1.0642
irintensity: 0.0635 1.4526 2.9156 0.9123 0.9851 1.2530 1.7512 0.8199 0.5080 0.3789 1.7831 0.2922 2.7689 0.1346 1.4741 0.1425 0.4456 0.1675 1.1240 4.6962 0.8394 0.7567 0.0094 3.9745 0.5826 4.7990 0.8776 2.9856 3.1255 0.1710 0.7835 1.0655 0.5001 1.1115 0.5892 0.3943 6.5647 1.7056 4.3564 5.2529 22.3344 24.1845 4.6704 126.4958 3.2816 40.2364 16.0986 0.4846 6.0640 13.3961 0.9679 8.3241 14.5008 4.7109 16.9324 3.5167 17.6999 11.9598 50.5347 32.3204 23.9789 9.3289 79.4187 3.2828 36.8434 5.0896 58.9231 21.5657 1.2386 103.7408 11.9385 0.1712 24.7471 76.7956 15.4197 2.8911 102.0069 16.4152 24.6335 9.9613 28.7228 30.6993 1.4567 39.0317 19.0248 6.6878 3.8476 0.8032 28.3305 2.3126 0.3018 4.8716 7.7054 1.8014 0.4143 0.1420 2.8999 0.5848 0.2904 6.1472 13.9177 4.3286 0.9874 6.4836 1.5235 0.7036 0.2048 7.3035 1.0537 11.3575 7.7871 14.8622 8.1000 12.6098 24.8733 14.2619 1.5168 0.9134 0.1421 0.6766 0.4776 5.3941 8.2064 8.5447 9.2784 2.0308 13.1518 1.8881 4.6475 39.6117 32.5853 45.8189 95.9954 152.0600 260.4106 18.4070 1.4218 5.6571 0.4415 1.3778 51.9330 156.6061 38.0276 3.2392 1.5156 9.3363 21.5809 1.1523 10.3216 12.9469 5.5566 12.3032 9.5706 3.3118 8.4079 0.5749 174.6088 3.5071 55.0990 93.5404 50.2458 15.2197 1.1822 1.3424 0.8569 0.1226 2.5669 4.1957 12.2710 2.1520 53.8189
temp: 298.150 k
press: 1.00000 atm
elementType: 8 8 8 8 7 6 6 6 6 6 6 6 6 6 6 6 6 6 6 6 6 6 6 1 1 1 1 1 1 1 1 1 1 1 1 1 1 1 1 1 1 1 1 1 1 1 1 1 1 1 1 1 1 1 1 1 1 1 1
symmnumber: 1
zpe: 1369377.8 jmol-1
zpe.correction: 0.521568 hartree
zpe.thermalcorrener: 0.549107 hartree
zpe.thermalcorrenthalpy: 0.550051 hartree
zpe.thermalcorrgfe: 0.459664 hartree
zpe.sumelectzpe: -1061.037174 hartree
zpe.sumelectthermal: -1061.009635 hartree
zpe.sumelectthermalent: -1061.008691 hartree
zpe.sumelectthermalfe: -1061.099078 hartree
dipole: 23.1140 1.6334 2.2101
dipole: 23.2768
quadrupole: -1.3602 -128.2773 -128.6123
quadrupole: 12.2786 16.4292 6.8319
quadrupole: 84.7231 -42.1940 -42.5290 12.2786 16.4292 6.8319
hfenergy: -1061.5587423 hartree
pointgroup: C01 [X(C18H36N1O4)]
dipole: -9.0986369 -0.9825486 0.3389728 debye
polarizability: 261.4884676|1.0236|191.340207|-5.3780196|3.2213525|186.8006584 unknown
InChI: InChI=1S/C18H36NO4/c1-5-6-7-8-9-10-11-12-13-18(22)23-16(14-17(20)21)15-19(2,3)4/h16,20H,5-15H2,1-4H3
charge 1 multiplicity 1
59 atoms
O  -2.44894 0.527636 -0.724731
O  -2.122261 1.725219 1.249969
O  -2.631097 -2.471131 -2.323297
O  -0.379475 -1.882534 -2.255155
N  -5.404117 -0.442912 0.405833
C  -4.236687 -1.110842 -0.369446
C  -2.827486 -0.676033 0.063443
C  -6.706415 -0.901401 -0.254273
C  -5.410584 -0.88506 1.868876
C  -5.326823 1.084294 0.342002
C  -1.739134 -1.744426 -0.198085
C  2.45891 1.23096 -0.884983
C  3.519146 0.970697 0.208698
C  1.129026 1.782341 -0.321927
C  4.848051 0.416473 -0.353089
C  0.091654 2.056502 -1.431856
C  5.913426 0.164892 0.737666
C  -1.264135 2.6263 -0.903255
C  -1.956982 1.653387 0.011755
C  7.242749 -0.389328 0.176931
C  -1.467919 -2.01459 -1.672267
C  8.309916 -0.637534 1.267497
C  9.633913 -1.190708 0.69754
H  -4.36566 -2.197785 -0.236993
H  -4.382409 -0.879115 -1.435866
H  -2.784066 -0.40912 1.137257
H  -6.728463 -0.538751 -1.293062
H  -6.75243 -2.001092 -0.241718
H  -7.558193 -0.48507 0.304757
H  -5.462974 -1.983703 1.914229
H  -4.499928 -0.525687 2.368911
H  -6.290349 -0.448948 2.366414
H  -5.236812 1.393539 -0.709693
H  -6.248742 1.495323 0.78207
H  -4.45398 1.431571 0.913986
H  -0.791667 -1.39925 0.245578
H  -2.020096 -2.69409 0.295049
H  2.86847 1.949158 -1.62517
H  2.26083 0.29012 -1.4394
H  3.112539 0.25645 0.955774
H  3.719446 1.913996 0.758247
H  1.323937 2.716256 0.243859
H  0.721372 1.057306 0.415167
H  5.253845 1.127483 -1.102594
H  4.650972 -0.530161 -0.898429
H  -0.099694 1.132043 -2.008794
H  0.501513 2.799214 -2.142483
H  5.509626 -0.545252 1.48988
H  6.112631 1.112358 1.280873
H  -1.922181 2.841273 -1.765903
H  -1.094849 3.559411 -0.340216
H  7.04742 -1.338726 -0.364653
H  7.648536 0.318884 -0.575479
H  7.904704 -1.345175 2.019703
H  8.506209 0.311091 1.807581
H  9.470179 -2.15234 0.175206
H  10.076999 -0.485732 -0.030885
H  10.37882 -1.363046 1.495701
H  -2.423388 -2.681933 -3.274553
