program: Gaussian 09
title: 000189372
version: EM64L-G09RevD.01
frameworkgroup: C1[X(C16H22N2O)]
method: RPBEPBE
basis: SDD
operation: Freq
keyword: #p
keyword: freq=noraman
keyword: PBEPBE/SDD
title: #p freq=noraman PBEPBE/SDD
converged: YES YES NO NO
title: Mulliken charges:
elementType: O N N C C C C C C C C C C C C C C C C H H H H H H H H H H H H H H H H H H H H H H
charge: -0.265967 -0.181756 -0.089208 0.305504 -0.443940 -0.706998 -0.724239 -0.702521 0.253579 -0.262362 0.375660 -0.466318 -0.369206 -0.412311 -0.385202 -0.360354 0.339705 -0.243958 -0.684566 0.221296 0.237115 0.214778 0.218771 0.208639 0.200776 0.217996 0.245760 0.218908 0.208357 0.232542 0.261935 0.263328 0.242860 0.244906 0.251175 0.244901 0.207852 0.209701 0.208018 0.232991 0.231851
chargesum: 0.00000
title: Mulliken charges with hydrogens summed into heavy atoms:
elementType: O N N C C C C C C C C C C C C C C C C
charge: -0.265967 -0.181756 -0.089208 0.305504 0.014472 -0.064810 -0.059707 -0.042713 0.253579 -0.000427 0.375660 -0.202989 -0.126346 -0.167405 -0.134027 -0.115453 0.339705 0.173595 -0.011707
polarizability: 2.72016410e+02 -2.18441238e+01 1.65120429e+02 8.25276135e+00 1.59760116e+01 1.48398673e+02
1716.lowfreq: -5.5143 -2.9652 -0.0005 -0.0003 0.0004 4.9988 28.0908 33.5160 52.8253
frequency: 28.0117 33.3121 52.8172 61.7620 82.0524 96.9719 110.0370 117.8196 153.1938 185.2655 211.5497 229.1896 244.5269 247.3692 258.6684 272.2408 286.0080 301.6079 342.5055 356.6647 381.7301 394.4845 399.2065 418.5755 445.3302 455.9883 476.6345 545.7570 618.6355 634.5551 652.5052 673.6507 728.3325 734.3465 749.8959 773.9827 777.4401 810.1096 819.4428 833.9895 842.3658 880.1248 898.0801 900.9898 902.4808 933.0259 934.8324 945.2450 947.0886 966.2031 992.8554 1019.7530 1027.6151 1033.2698 1036.6935 1108.1403 1111.7025 1118.9880 1134.0822 1135.5566 1179.7059 1205.8521 1217.9405 1218.9606 1225.9833 1253.5167 1261.3158 1270.4657 1283.4000 1300.8456 1328.2882 1346.1235 1360.4814 1363.3672 1368.4681 1376.5709 1378.5594 1399.3207 1405.1843 1415.7901 1427.7992 1458.8961 1460.9503 1462.5590 1466.9406 1470.6733 1472.8323 1480.3218 1483.8498 1486.7464 1491.6269 1497.4165 1549.0238 1571.2779 1625.1128 2954.2443 2965.8392 2970.0357 2976.5489 2997.2803 3001.7440 3012.6336 3058.6318 3062.6327 3069.1017 3073.5595 3076.3181 3079.6809 3081.2505 3094.9809 3105.7963 3132.0376 3137.3045 3163.5706 3166.9941 3222.7041 3232.5312
redmass: 3.9266 2.7613 3.1080 4.0765 4.1339 3.9759 4.2434 1.8705 3.7528 2.6197 1.1787 3.8963 1.2446 2.5893 1.1757 1.2074 2.6944 3.0684 2.5492 3.3784 2.5141 2.4160 3.0272 3.0107 3.7516 3.9890 2.8209 2.5910 5.8958 6.2090 3.7423 3.8793 3.9277 3.3082 4.0276 1.5076 4.5552 1.2694 1.3933 1.1509 1.5839 3.5980 2.2823 2.3256 3.1848 1.5187 1.5703 1.2663 1.2952 1.3337 4.3728 2.2388 1.5969 1.4967 2.7678 2.2776 1.6541 1.7439 1.8258 1.4377 1.2678 1.8723 2.3544 2.2226 2.9616 2.9854 1.1428 3.2106 2.9764 1.3860 2.3370 2.1208 2.7382 1.7105 1.5944 1.2032 1.2241 1.2661 1.2280 3.7719 2.6991 1.0507 1.0401 1.1093 1.0758 1.1152 1.5470 1.2505 1.0839 1.0640 1.2001 1.0633 5.3828 7.4677 6.5137 1.0553 1.0354 1.0358 1.0360 1.0361 1.0628 1.1075 1.0998 1.0991 1.0999 1.0990 1.0998 1.0986 1.0988 1.0990 1.1014 1.0888 1.0885 1.0948 1.0958 1.0962 1.0998
irintensity: 0.6282 0.0803 0.7105 1.1410 1.1667 0.7393 1.0087 2.2609 0.7508 0.9795 0.3231 1.2756 0.7508 0.3638 0.0303 0.0683 0.5938 1.6266 0.6949 0.2910 0.0799 0.5461 0.3280 0.3057 0.8900 0.4076 1.4121 21.0355 8.9726 17.5970 14.4893 4.8154 2.1330 5.9688 1.4693 22.8028 2.1558 42.7799 20.2952 3.2550 50.5112 10.8871 16.9352 14.0531 31.7894 1.1172 2.1774 0.2312 0.2254 0.4347 6.8995 1.1495 0.8467 1.3835 71.8551 31.9454 2.7199 12.9675 1.4132 4.4773 110.1020 38.7926 8.7510 3.4071 268.5567 14.0364 0.0782 11.7939 6.4518 0.9070 10.2686 1.6487 6.8311 2.0074 18.6576 16.5542 27.5689 35.7798 19.1103 11.0902 25.7681 0.3151 11.9936 2.6689 3.5283 7.3164 125.6615 27.1119 12.2851 6.2709 3.9797 37.1535 75.6183 1.8132 43.8459 39.3007 30.0138 37.8692 13.6353 28.0329 33.6653 35.4265 12.5031 28.3374 4.7708 53.2722 10.8087 64.2241 46.0391 28.9166 34.2493 11.6462 14.5426 14.7952 4.3762 6.4449 0.5389
temp: 298.150 k
press: 1.00000 atm
elementType: 8 7 7 6 6 6 6 6 6 6 6 6 6 6 6 6 6 6 6 1 1 1 1 1 1 1 1 1 1 1 1 1 1 1 1 1 1 1 1 1 1
symmnumber: 1
zpe: 909561.7 jmol-1
zpe.correction: 0.346434 hartree
zpe.thermalcorrener: 0.365901 hartree
zpe.thermalcorrenthalpy: 0.366845 hartree
zpe.thermalcorrgfe: 0.298054 hartree
zpe.sumelectzpe: -806.190169 hartree
zpe.sumelectthermal: -806.170702 hartree
zpe.sumelectthermalent: -806.169758 hartree
zpe.sumelectthermalfe: -806.238549 hartree
dipole: -2.6314 4.0954 -0.4853
dipole: 4.8921
quadrupole: -103.4725 -127.3682 -110.6673
quadrupole: 15.6737 11.7445 1.1819
quadrupole: 10.3635 -13.5322 3.1687 15.6737 11.7445 1.1819
hfenergy: -806.5366027 hartree
pointgroup: C01 [X(C16H22N2O1)]
dipole: 1.0857799 1.5369419 -0.404098 debye
polarizability: 273.4888939|16.4206063|151.8100712|-7.3711953|-18.9036728|160.2365474 unknown
InChI: InChI=1S/C16H22N2O/c1-5-19-14-8-6-13(7-9-14)15-10-17-12-18(15)11-16(2,3)4/h6-10,12H,5,11H2,1-4H3
charge 0 multiplicity 1
41 atoms
O  4.28766 0.262456 -0.816167
N  -2.297743 -0.520503 -0.048966
N  -2.980094 -2.207481 1.32115
C  -2.656521 2.031567 -0.11719
C  -2.411744 0.690146 -0.886902
C  -2.670312 3.153378 -1.191208
C  -4.01805 2.011339 0.622732
C  -1.514886 2.294915 0.896501
C  -1.122368 -1.107138 0.48361
C  -3.37621 -1.224316 0.488993
C  0.262201 -0.719401 0.153721
C  -1.581443 -2.133575 1.324624
C  0.718519 -0.580492 -1.190556
C  1.20916 -0.533058 1.19399
C  2.053636 -0.250012 -1.477173
C  2.557212 -0.213049 0.922764
C  2.982005 -0.061676 -0.421403
C  5.30444 0.438782 0.240944
C  6.620578 0.758343 -0.462501
H  -3.244559 0.52952 -1.598549
H  -1.484876 0.792412 -1.475328
H  -1.702315 3.212547 -1.724315
H  -2.8547 4.135227 -0.718205
H  -3.467053 2.986748 -1.941731
H  -4.856393 1.82556 -0.07653
H  -4.198294 2.986184 1.112487
H  -4.041441 1.233141 1.406142
H  -0.528324 2.314947 0.397683
H  -1.667949 3.269647 1.396077
H  -1.483578 1.513682 1.676869
H  -4.408521 -0.990246 0.239676
H  -0.979524 -2.844054 1.887503
H  0.031781 -0.780487 -2.0212
H  0.878869 -0.630972 2.234185
H  2.406568 -0.153043 -2.508421
H  3.252867 -0.077301 1.755914
H  4.996319 1.265025 0.914491
H  5.381199 -0.493919 0.836948
H  7.424223 0.902994 0.282239
H  6.911347 -0.065284 -1.136501
H  6.527917 1.680346 -1.061397
