program: Gaussian 09
title: 000189371
version: EM64L-G09RevD.01
frameworkgroup: C1[X(C16H22N2O)]
method: RPBEPBE
basis: SDD
operation: Freq
keyword: #p
keyword: freq=noraman
keyword: PBEPBE/SDD
title: #p freq=noraman PBEPBE/SDD
converged: YES YES NO NO
title: Mulliken charges:
elementType: O N N C C C C C C C C C C C C C C C C H H H H H H H H H H H H H H H H H H H H H H
charge: -0.270475 -0.184236 -0.088762 0.305373 -0.444445 -0.706948 -0.724763 -0.702239 0.261604 -0.261297 0.404530 -0.460548 -0.558868 -0.423157 0.361261 -0.229154 -0.381675 -0.243398 -0.684684 0.220929 0.239720 0.214483 0.219031 0.208314 0.200531 0.218586 0.245606 0.218572 0.208608 0.233937 0.262929 0.265520 0.269915 0.244059 0.223917 0.248979 0.209099 0.206330 0.206836 0.232301 0.233677
chargesum: 0.00000
title: Mulliken charges with hydrogens summed into heavy atoms:
elementType: O N N C C C C C C C C C C C C C C C C
charge: -0.270475 -0.184236 -0.088762 0.305373 0.016205 -0.065120 -0.060040 -0.041122 0.261604 0.001632 0.404530 -0.195029 -0.288953 -0.179097 0.361261 -0.005237 -0.132696 0.172031 -0.011869
polarizability: 2.56280333e+02 -2.03048846e+01 1.65276204e+02 -2.87509554e+00 -1.98997020e+01 1.58943564e+02
1716.lowfreq: -11.5050 -5.2510 0.0003 0.0005 0.0007 3.9506 23.9906 26.6034 52.5312
frequency: 23.6810 26.4897 52.4520 67.1645 80.9784 95.4802 102.2553 125.5326 158.3418 193.3153 210.5271 233.6146 249.0917 250.6552 252.7923 263.1884 282.5788 307.1856 334.6344 335.8794 358.7953 383.7171 387.8316 408.5590 450.7841 472.6787 483.9007 591.5516 610.3467 652.5878 668.0272 678.7903 702.9324 735.2664 748.0774 780.3285 784.4041 794.6212 823.5855 826.3889 879.3639 880.6805 897.2151 898.5305 902.8525 924.6974 932.0444 934.2173 944.2929 966.3064 981.8568 1023.7242 1032.7543 1033.9668 1044.5941 1096.1912 1108.9664 1116.9998 1132.8228 1135.0195 1174.8725 1193.7818 1212.9218 1217.6169 1222.1383 1248.0455 1260.4039 1270.5163 1285.8906 1290.9577 1329.2417 1351.9201 1362.6974 1363.2946 1376.7223 1380.0639 1383.4542 1399.3011 1406.6237 1420.5402 1436.8699 1457.5755 1458.8578 1460.9083 1463.5385 1467.4849 1471.8796 1477.4290 1483.7563 1486.5121 1489.4173 1498.3033 1540.8734 1579.7825 1619.7225 2952.5284 2967.0521 2970.2214 2977.4657 2997.1737 3001.1032 3010.5738 3059.8797 3063.2134 3070.4652 3074.3532 3076.1714 3079.5746 3080.9342 3094.6909 3105.9603 3128.2300 3149.4790 3161.4559 3169.2317 3224.9899 3235.3932
redmass: 3.9154 2.8598 3.2606 4.3374 4.0592 2.8518 2.9427 2.5799 3.8279 1.3631 1.9530 2.0593 3.0571 1.7581 1.0964 2.0943 1.3697 3.0832 2.7681 3.8051 4.4690 2.7122 2.8691 1.9053 3.0438 3.2453 3.2937 5.7417 4.8216 4.0405 5.0811 4.5644 2.1214 3.5991 4.0931 1.4225 1.5406 3.6015 1.3152 1.2040 1.3990 3.7104 2.1730 2.2310 1.5842 3.0669 1.5188 1.5950 1.2052 1.3495 5.1783 1.4823 2.1074 1.7489 2.2355 1.7170 2.2686 2.1788 1.8434 1.4444 1.4061 1.6501 1.8216 2.2706 2.7162 2.9439 1.1432 3.2029 2.6933 1.5031 2.4735 1.9514 1.4556 1.7248 1.1985 1.2264 4.6964 1.2791 1.2327 2.8820 2.8599 1.0515 2.0107 1.0399 1.1683 1.0582 1.1476 1.0722 1.0733 1.0629 1.0943 1.0630 6.0950 5.9488 6.7678 1.0553 1.0355 1.0360 1.0362 1.0362 1.0625 1.1075 1.0997 1.0990 1.0997 1.0992 1.1000 1.0988 1.0987 1.0989 1.1013 1.0862 1.0934 1.0921 1.0964 1.0964 1.0996
irintensity: 0.6301 0.1226 0.0905 2.7982 0.5730 1.4077 0.1246 1.5739 0.8338 0.0923 0.1148 0.4820 1.1350 1.0310 0.1150 0.5366 1.5952 0.5092 1.5549 0.2322 0.1054 0.1103 0.1246 0.8047 2.6417 0.7954 3.5065 6.6116 0.2529 18.9052 0.5192 1.5027 26.2014 6.1683 3.0857 8.2321 78.1614 15.7772 13.8797 6.7681 2.6098 18.3622 7.0283 26.0217 28.7916 33.2064 2.5876 5.6745 0.0199 0.7999 1.4991 0.8818 22.5081 23.3074 45.1473 10.0034 35.3909 5.5461 10.5288 4.6342 98.0988 63.2791 44.3162 2.6934 50.4490 14.0066 0.0992 29.5327 53.7208 3.0855 14.9928 2.4415 10.2150 1.8630 20.6447 22.3302 19.3619 39.7222 19.2477 20.2328 26.9498 0.4920 33.4849 11.9839 15.8288 1.5233 33.6053 6.0493 26.2632 6.4191 4.3746 37.9478 11.3973 78.1860 127.1426 42.2050 29.7455 37.4817 13.2575 26.9168 35.0056 36.4477 8.6050 32.6116 8.2199 35.5095 12.2293 61.4754 57.1360 29.7731 33.5582 7.5708 20.7536 2.2364 12.8817 5.2694 0.6982
temp: 298.150 k
press: 1.00000 atm
elementType: 8 7 7 6 6 6 6 6 6 6 6 6 6 6 6 6 6 6 6 1 1 1 1 1 1 1 1 1 1 1 1 1 1 1 1 1 1 1 1 1 1
symmnumber: 1
zpe: 909461.9 jmol-1
zpe.correction: 0.346396 hartree
zpe.thermalcorrener: 0.365895 hartree
zpe.thermalcorrenthalpy: 0.366839 hartree
zpe.thermalcorrgfe: 0.297724 hartree
zpe.sumelectzpe: -806.189992 hartree
zpe.sumelectthermal: -806.170493 hartree
zpe.sumelectthermalent: -806.169549 hartree
zpe.sumelectthermalfe: -806.238665 hartree
dipole: 1.9568 -5.0668 1.8882
dipole: 5.7504
quadrupole: -93.5302 -128.4449 -113.3249
quadrupole: 7.0516 -2.2708 1.1673
quadrupole: 18.2364 -16.6782 -1.5582 7.0516 -2.2708 1.1673
hfenergy: -806.5363881 hartree
pointgroup: C01 [X(C16H22N2O1)]
dipole: 0.9589891 1.0886986 -1.7359074 debye
polarizability: 259.3554735|0.6990602|141.7133485|-10.0414122|-8.5392802|179.4312792 unknown
InChI: InChI=1S/C16H22N2O/c1-5-19-14-8-6-7-13(9-14)15-10-17-12-18(15)11-16(2,3)4/h6-10,12H,5,11H2,1-4H3
charge 0 multiplicity 1
41 atoms
O  3.859445 0.055682 0.741274
N  -2.175176 -0.330687 0.266716
N  -2.544293 -1.473379 2.202664
C  -2.475288 2.121224 -0.471224
C  -2.453584 0.600949 -0.845547
C  -2.688089 2.89267 -1.802195
C  -3.639179 2.443311 0.500085
C  -1.128535 2.5440 0.167508
C  -0.922836 -0.855977 0.671016
C  -3.105472 -0.7342 1.224863
C  0.343959 -0.739043 -0.077838
C  -1.187049 -1.543366 1.866323
C  1.524235 -0.379668 0.615267
C  0.427893 -1.036567 -1.471013
C  2.767755 -0.312576 -0.058921
C  1.666862 -0.957312 -2.13557
C  2.847628 -0.593896 -1.446347
C  5.186277 0.150743 0.10025
C  6.169142 0.582116 1.185179
H  -3.433581 0.324566 -1.280241
H  -1.68632 0.446615 -1.622219
H  -1.860568 2.704982 -2.512409
H  -2.729664 3.980619 -1.611984
H  -3.63661 2.600033 -2.292478
H  -4.616366 2.145517 0.072496
H  -3.676809 3.530129 0.700177
H  -3.51321 1.929572 1.46959
H  -0.276777 2.325924 -0.502971
H  -1.131108 3.629866 0.377351
H  -0.951752 2.015384 1.121429
H  -4.159454 -0.474537 1.16132
H  -0.484401 -2.118275 2.46585
H  1.491851 -0.135893 1.681628
H  -0.460006 -1.381843 -2.01162
H  1.724591 -1.198289 -3.203042
H  3.797706 -0.543591 -1.985635
H  5.462156 -0.836404 -0.324805
H  5.146084 0.892464 -0.724305
H  7.186991 0.668783 0.763314
H  5.879351 1.56003 1.605856
H  6.191397 -0.155078 2.005713
