program: Gaussian 09
title: 000189370
version: EM64L-G09RevD.01
frameworkgroup: C1[X(C15H20N2O)]
method: RPBEPBE
basis: SDD
operation: Freq
keyword: #p
keyword: freq=noraman
keyword: PBEPBE/SDD
title: #p freq=noraman PBEPBE/SDD
converged: YES YES NO NO
title: Mulliken charges:
elementType: O N N C C C C C C C C C C C C C C C H H H H H H H H H H H H H H H H H H H H
charge: -0.318376 -0.181678 -0.087107 0.309820 -0.458639 -0.707230 -0.724533 -0.702773 0.248762 -0.265146 0.284234 -0.470407 0.152009 -0.390960 -0.355795 -0.250729 -0.215893 -0.526781 0.212107 0.284235 0.218570 0.216532 0.207869 0.200165 0.217952 0.241837 0.219647 0.208350 0.229082 0.262800 0.266941 0.251195 0.252799 0.230398 0.231524 0.254451 0.222801 0.231966
chargesum: 0.00000
title: Mulliken charges with hydrogens summed into heavy atoms:
elementType: O N N C C C C C C C C C C C C C C C
charge: -0.318376 -0.181678 -0.087107 0.309820 0.037704 -0.064259 -0.064578 -0.045694 0.248762 -0.002346 0.284234 -0.203467 0.152009 -0.139765 -0.102995 -0.020330 0.015631 0.182437
polarizability: 1.96224860e+02 -3.17966958e+01 1.66412970e+02 -1.17180393e+01 -4.73933675e+00 1.60719323e+02
1716.lowfreq: -16.4209 -13.4653 -5.7993 0.0004 0.0006 0.0008 17.0606 40.8537 52.3212
frequency: 12.9704 40.8380 52.3016 76.4561 101.4379 106.2180 111.7776 137.0101 159.0823 181.1086 215.6465 236.6851 248.8345 254.1310 265.1383 289.4184 312.0416 329.5083 360.5073 379.8825 392.2747 423.0040 462.8562 473.1277 502.5343 547.0513 569.2817 647.1637 654.7184 672.4837 733.4958 738.7228 757.9852 765.9410 778.5258 786.3613 821.3657 876.7375 881.4757 896.8438 902.3403 930.3673 932.0042 943.9722 950.0391 955.1509 986.2912 1000.8419 1022.7705 1035.5530 1040.8315 1093.0651 1109.9020 1111.1162 1130.9585 1150.0976 1166.7848 1189.9657 1205.0856 1215.7447 1217.9328 1250.3024 1257.2318 1266.4225 1285.5492 1331.2988 1354.9246 1355.9946 1360.1263 1374.3078 1381.3254 1406.8000 1417.0047 1426.8418 1438.8051 1455.4037 1457.5933 1459.6318 1461.4049 1465.8510 1474.3249 1478.6307 1483.6503 1486.9916 1498.5056 1538.2420 1571.9604 1609.8715 2965.6220 2969.3499 2969.8837 2977.6213 3001.0730 3058.3189 3062.8287 3064.4188 3068.8677 3072.0334 3076.4101 3080.2463 3086.7977 3120.2804 3130.4441 3141.1016 3156.5128 3170.2713 3220.7939 3232.9073
redmass: 2.8641 4.5973 3.6762 2.6534 3.6541 4.3599 3.8129 1.5600 1.7571 1.0964 2.0232 3.5165 1.3241 1.3579 2.0334 5.6033 3.7158 2.4418 3.8572 2.3459 2.6698 2.2701 2.8267 4.6328 4.1298 4.4992 3.6411 4.8615 4.7097 3.9277 3.9154 3.6767 2.9027 2.4937 2.0259 1.4560 1.4506 1.5584 2.9737 2.2791 2.2335 1.5070 1.5833 1.2119 3.9133 1.7159 1.3261 5.3339 1.4520 1.4890 1.9970 2.0091 2.1299 1.2777 1.7921 1.3434 1.0760 2.7288 2.1584 1.9859 2.3346 2.7907 1.7477 3.1743 2.7037 2.1333 1.8441 6.7933 2.1576 1.2019 1.2234 1.2395 1.9658 2.0075 1.8674 1.0577 2.0712 1.0675 1.0568 1.0484 1.0536 1.0854 1.0654 1.0957 1.0723 5.6250 6.7255 7.0078 1.0354 1.0356 1.0313 1.0362 1.0647 1.0998 1.0989 1.1041 1.1001 1.0993 1.0990 1.0988 1.0983 1.1019 1.0854 1.0902 1.0946 1.1004 1.0965 1.0995
irintensity: 0.0379 1.2297 0.2962 4.9672 0.6564 1.1357 1.2178 1.0540 4.7550 0.2228 1.2766 3.2368 1.1383 0.5159 1.0822 1.0956 1.6380 0.1787 0.7298 0.1182 0.5533 0.3565 1.9422 7.5732 10.0877 4.0864 3.0211 15.2369 8.7787 2.9521 5.1912 1.5104 14.8936 22.9860 54.0059 37.5333 16.6369 0.8979 7.1301 13.8144 10.3376 1.0196 2.8581 0.1019 35.1103 20.5027 0.1537 3.2644 0.5367 1.0410 13.9116 24.2437 27.3329 5.4470 3.0329 0.2116 0.6130 64.7281 41.9617 6.6251 4.9627 15.9388 5.4428 6.8844 3.6478 6.9789 6.3212 4.6106 1.9864 21.7039 21.9237 17.9823 11.4054 36.9326 2.8115 1.4345 48.8470 10.2003 0.4486 1.5118 5.6723 3.8610 4.9480 31.0313 39.5226 17.3342 9.5783 1.3840 29.3715 38.3987 60.4200 14.3498 30.1245 5.6163 39.7082 34.0205 3.5699 20.0410 87.2440 45.4758 8.5551 20.7006 0.5076 9.9367 18.1092 18.8812 4.8590 0.7451
temp: 298.150 k
press: 1.00000 atm
elementType: 8 7 7 6 6 6 6 6 6 6 6 6 6 6 6 6 6 6 1 1 1 1 1 1 1 1 1 1 1 1 1 1 1 1 1 1 1 1
symmnumber: 1
zpe: 834506.2 jmol-1
zpe.correction: 0.317847 hartree
zpe.thermalcorrener: 0.336220 hartree
zpe.thermalcorrenthalpy: 0.337164 hartree
zpe.thermalcorrgfe: 0.270607 hartree
zpe.sumelectzpe: -766.957199 hartree
zpe.sumelectthermal: -766.938826 hartree
zpe.sumelectthermalent: -766.937881 hartree
zpe.sumelectthermalfe: -767.004439 hartree
dipole: 0.8005 -2.7802 1.4254
dipole: 3.2252
quadrupole: -99.2251 -119.4637 -104.4022
quadrupole: 4.5147 -4.6701 8.0257
quadrupole: 8.4719 -11.7667 3.2948 4.5147 -4.6701 8.0257
hfenergy: -767.2750457 hartree
pointgroup: C01 [X(C15H20N2O1)]
dipole: -0.1571201 0.8498275 0.929088 debye
polarizability: 183.053744|-37.6443688|175.5159734|-0.1112402|5.7501964|164.7874358 unknown
InChI: InChI=1S/C15H20N2O/c1-15(2,3)10-17-11-16-9-13(17)12-7-5-6-8-14(12)18-4/h5-9,11H,10H2,1-4H3
charge 0 multiplicity 1
38 atoms
O  -1.43163 -0.419057 1.818106
N  0.947897 -1.028032 -0.272504
N  0.794902 -2.517914 -1.991232
C  2.556786 0.852524 0.448486
C  1.568488 -0.291411 0.85004
C  3.044646 1.488059 1.778901
C  3.772482 0.289587 -0.330622
C  1.841258 1.92674 -0.408426
C  -0.27405 -0.757785 -0.933638
C  1.540509 -2.091584 -0.950925
C  -1.261669 0.277885 -0.567921
C  -0.329268 -1.684916 -1.988727
C  -1.816639 0.421912 0.740329
C  -1.725151 1.168357 -1.576702
C  -2.741757 1.447648 1.032175
C  -2.669664 2.177907 -1.297554
C  -3.168164 2.331503 0.017279
C  -1.854394 -1.832108 1.700413
H  2.118329 -1.032921 1.461604
H  0.757462 0.111183 1.477854
H  2.199936 1.909687 2.355521
H  3.757562 2.307661 1.574222
H  3.559154 0.744223 2.417342
H  4.314865 -0.472504 0.262361
H  4.485301 1.101738 -0.565574
H  3.463569 -0.17146 -1.286006
H  0.960718 2.341089 0.116309
H  2.534183 2.760164 -0.628516
H  1.496962 1.509051 -1.371461
H  2.497586 -2.512162 -0.650979
H  -1.132645 -1.81541 -2.711105
H  -1.308448 1.069243 -2.58525
H  -3.122119 1.524076 2.05582
H  -3.000644 2.850542 -2.095898
H  -3.88815 3.123921 0.248815
H  -1.44063 -2.304823 0.791107
H  -2.959055 -1.89742 1.686131
H  -1.460018 -2.330896 2.598726
