program: Gaussian 09
title: 000189366
version: EM64L-G09RevD.01
frameworkgroup: C1[X(C16H22ClN5)]
method: RPBEPBE
basis: SDD
operation: Freq
keyword: #p
keyword: freq=noraman
keyword: PBEPBE/SDD
title: #p freq=noraman PBEPBE/SDD
converged: YES YES NO NO
title: Mulliken charges:
elementType: Cl N N N N N C C C C C C C C C C C C C C C C H H H H H H H H H H H H H H H H H H H H H H
charge: -0.031945 -0.391854 -0.115795 -0.134846 0.001176 -0.012537 0.162627 0.518278 -0.749064 -0.752504 -0.400770 -0.389065 0.072522 -0.356081 -0.352667 0.144132 -0.239674 -0.245712 -0.244290 -0.662169 -0.662924 -0.297185 0.217664 0.205628 0.281598 0.243971 0.215882 0.231359 0.320933 0.237590 0.235359 0.251331 0.210945 0.263583 0.206510 0.222220 0.222390 0.226671 0.212088 0.244441 0.215170 0.205998 0.251895 0.217123
chargesum: 0.00000
title: Mulliken charges with hydrogens summed into heavy atoms:
elementType: Cl N N N N N C C C C C C C C C C C C C C C C
charge: -0.031945 -0.070921 -0.115795 -0.134846 0.001176 -0.012537 0.162627 0.518278 -0.044174 -0.061292 -0.163180 -0.153707 0.072522 0.106195 0.117426 0.144132 -0.017454 -0.023322 -0.017619 0.009530 0.012092 -0.297185
polarizability: 2.74619519e+02 -2.22709208e+01 2.17872088e+02 8.20159688e+00 1.84052685e+00 1.79887753e+02
1716.lowfreq: -10.2061 -7.3186 -3.3951 -0.0011 0.0013 0.0023 17.9358 20.7653 27.6237
frequency: 17.8118 20.3922 27.6172 40.8040 46.0302 56.3252 86.0850 94.8570 126.4413 155.1851 165.1258 176.7000 178.6449 210.0352 216.6478 226.5320 232.0674 252.6570 271.2949 296.0171 306.5844 318.0441 326.4350 345.7326 372.8982 397.8358 401.0583 411.3530 465.0334 504.6564 532.8866 544.1402 549.0516 556.0398 590.2931 617.3028 642.1749 681.4294 700.4788 704.2402 715.6498 760.2539 771.2371 776.0729 786.3978 794.4752 848.5063 869.9199 884.6090 907.7702 918.9940 928.5028 938.3380 947.7231 974.1930 989.9999 993.4338 1008.8165 1011.2799 1026.5549 1045.0528 1075.7544 1080.9222 1084.1842 1098.1852 1106.9606 1149.9792 1172.4234 1175.0631 1187.7781 1193.3766 1210.9733 1242.1267 1252.4113 1260.2967 1305.8402 1309.7556 1318.7240 1347.7543 1349.3454 1366.1078 1372.2556 1380.4207 1382.1385 1385.1815 1391.3590 1435.2338 1450.7944 1453.3098 1460.3122 1465.1050 1466.6291 1468.4126 1469.0727 1474.3256 1481.7359 1482.7612 1484.3884 1485.0229 1496.0092 1536.6375 1583.5830 1593.4147 1614.0540 2977.5138 2984.5449 2984.8520 2993.6406 3004.0205 3009.6542 3070.7604 3071.7310 3072.4590 3084.4324 3086.4220 3090.1689 3101.5353 3102.0588 3104.4368 3115.8929 3116.7849 3126.6247 3139.1249 3153.9359 3166.6085 3545.3365
redmass: 4.5080 4.0312 4.8361 3.0019 4.0006 2.7105 4.7177 4.5609 4.1858 2.5564 6.0803 6.2007 6.2442 1.8804 1.4884 2.0057 1.3011 1.5305 2.4494 1.1557 3.0891 2.4923 3.2187 3.3490 3.3081 5.1785 2.8179 3.4636 4.7863 3.5146 3.5123 1.8894 2.2126 2.0221 3.9558 6.3963 11.7201 6.1792 2.1723 4.1252 5.0393 2.2432 1.9310 1.2679 6.6614 1.6176 1.2554 5.5198 3.6421 2.6126 1.7582 1.4532 2.1453 2.5628 1.3930 2.9202 1.7102 2.5772 1.3856 2.4029 2.9269 2.0912 1.8474 1.6493 1.7728 2.0907 3.0818 1.0598 2.8283 2.5533 1.1265 3.3770 3.3794 3.2936 3.7747 1.4996 1.6143 1.3448 1.6183 1.5922 1.3939 1.2217 7.0076 1.2209 1.2169 1.2463 2.2134 1.3994 1.4440 1.2215 1.1751 1.0529 1.1441 1.2326 1.7122 1.0718 1.2049 1.1087 1.9880 1.0920 4.4167 5.7371 6.1468 6.0934 1.0363 1.0358 1.0355 1.0359 1.0644 1.0645 1.0994 1.1004 1.0992 1.0993 1.0981 1.0973 1.1022 1.0983 1.1024 1.1001 1.0856 1.0871 1.0931 1.0956 1.0993 1.0766
irintensity: 0.6593 0.2718 0.1226 0.2125 0.2095 0.0639 1.6882 0.9531 0.0948 1.1133 0.8847 0.1809 0.3626 0.0232 1.1248 0.0807 0.2915 0.2870 0.5198 0.1322 1.7841 1.7553 5.6525 0.3116 5.8560 6.8904 0.0947 1.2090 4.9420 0.8354 4.2410 9.8935 45.8033 40.0846 21.1529 0.1352 2.3403 11.0674 42.2038 20.0503 2.6891 18.9963 37.4178 2.9941 19.6658 45.8848 1.0698 13.8410 5.9952 24.7528 11.7584 8.4012 0.7469 10.9448 0.3349 0.3184 0.9218 21.0572 3.7867 12.3155 21.1452 13.4983 40.3827 20.5347 14.2561 10.2747 54.2825 0.5030 40.1668 86.2790 3.7866 31.8004 43.1848 93.9658 39.0994 52.5066 29.5767 0.3523 208.3467 152.5373 46.3994 18.5179 3.7104 7.6179 35.8554 42.6931 14.9207 38.8938 133.3523 59.8571 12.5738 10.2651 33.2854 67.5723 15.4059 29.3179 24.5385 15.1336 20.6689 19.5159 1916.4324 125.7258 1.1071 4.7391 25.8829 29.8275 30.1038 31.7287 31.3819 64.8950 10.9332 31.1247 14.1137 39.1538 38.5535 28.9047 22.5551 23.1548 39.3362 7.7667 6.5036 1.1074 29.0898 36.7635 14.9937 45.2972
temp: 298.150 k
press: 1.00000 atm
elementType: 17 7 7 7 7 7 6 6 6 6 6 6 6 6 6 6 6 6 6 6 6 6 1 1 1 1 1 1 1 1 1 1 1 1 1 1 1 1 1 1 1 1 1 1
symmnumber: 1
zpe: 944842.8 jmol-1
zpe.correction: 0.359872 hartree
zpe.thermalcorrener: 0.382564 hartree
zpe.thermalcorrenthalpy: 0.383508 hartree
zpe.thermalcorrgfe: 0.305462 hartree
zpe.sumelectzpe: -1355.096314 hartree
zpe.sumelectthermal: -1355.073622 hartree
zpe.sumelectthermalent: -1355.072678 hartree
zpe.sumelectthermalfe: -1355.150723 hartree
dipole: 1.2444 -4.7070 -0.2561
dipole: 4.8754
quadrupole: -118.5814 -139.7035 -132.5665
quadrupole: -5.8326 4.1356 1.8094
quadrupole: 11.7024 -9.4197 -2.2827 -5.8326 4.1356 1.8094
hfenergy: -1355.4561858 hartree
pointgroup: C01 [X(C16H22Cl1N5)]
dipole: -0.4735825 -1.850225 -0.1778255 debye
polarizability: 273.754342|21.1313619|217.8819875|13.5340475|4.2173927|180.7430307 unknown
InChI: InChI=1S/C16H22ClN5/c1-5-22(6-2)15-19-13(17)18-14(20-15)21-16(3,4)12-10-8-7-9-11-12/h7-11,21H,5-6H2,1-4H3
charge 0 multiplicity 1
44 atoms
Cl -0.602942 3.513233 0.754862
N  0.754366 -1.363707 0.792046
N  -3.670828 -0.335351 -0.372498
N  -1.446828 -0.896611 0.192464
N  0.092003 0.912812 0.773607
N  -2.194994 1.428858 0.155708
C  2.17376 -1.115166 1.185178
C  2.89607 -0.281474 0.096702
C  2.221249 -0.465745 2.591562
C  2.840631 -2.519801 1.249348
C  3.817415 0.743508 0.418161
C  2.688012 -0.595733 -1.27158
C  -0.218206 -0.424755 0.58308
C  -3.998276 -1.771335 -0.521284
C  -4.736719 0.664261 -0.623203
C  -2.413012 0.058904 -0.002207
C  4.514059 1.435554 -0.599041
C  3.378912 0.093689 -2.289853
C  4.300975 1.113462 -1.957304
C  -3.760795 -2.288197 -1.956416
C  -5.540652 1.005252 0.649047
C  -0.945823 1.73249 0.529628
H  1.644782 -1.086714 3.300049
H  3.259456 -0.406385 2.963169
H  1.782021 0.543832 2.565216
H  3.905503 -2.413228 1.513485
H  2.353707 -3.149615 2.018092
H  2.786908 -3.033398 0.272102
H  0.445922 -2.329696 0.663561
H  3.983837 1.027787 1.4614
H  1.960353 -1.37071 -1.542089
H  -3.373569 -2.340422 0.186271
H  -5.057933 -1.902146 -0.23201
H  -4.265547 1.578543 -1.017564
H  -5.400948 0.249161 -1.40444
H  5.215569 2.233096 -0.328782
H  3.19614 -0.159223 -3.340596
H  4.837104 1.653751 -2.745574
H  -4.356249 -1.719836 -2.694001
H  -2.693798 -2.194395 -2.220921
H  -4.047256 -3.353385 -2.032567
H  -5.992976 0.101929 1.098186
H  -4.881655 1.479246 1.395921
H  -6.355149 1.712561 0.407283
