program: Gaussian 09
title: 000190923
version: EM64L-G09RevD.01
frameworkgroup: C1[X(C11H10N2O3)]
method: RPBEPBE
basis: SDD
operation: Freq
keyword: #p
keyword: freq=noraman
keyword: PBEPBE/SDD
title: #p freq=noraman PBEPBE/SDD
converged: YES YES NO NO
title: Mulliken charges:
elementType: O O O N N C C C C C C C C C C C H H H H H H H H H H
charge: -0.250842 -0.413969 -0.223988 -0.401646 -0.592685 0.331958 -0.265812 0.191464 0.282857 0.038904 -0.417597 -0.355602 -0.375527 0.165718 -0.255722 -0.206425 0.221763 0.262207 0.317544 0.282362 0.227210 0.235792 0.232489 0.269201 0.320917 0.379431
chargesum: 0.00000
title: Mulliken charges with hydrogens summed into heavy atoms:
elementType: O O O N N C C C C C C C C C C C
charge: -0.250842 -0.034538 -0.223988 -0.084102 -0.002567 0.331958 -0.044049 0.191464 0.282857 0.038904 -0.155390 -0.073240 -0.148317 0.165718 -0.019930 0.026064
polarizability: 2.08522513e+02 -3.44188086e+00 1.45888863e+02 -1.12635617e+01 7.36654506e+00 8.30046119e+01
1716.lowfreq: -8.7163 -0.0005 -0.0003 -0.0001 3.3649 7.7375 30.1784 53.9000 90.6772
frequency: 29.8503 53.8582 90.6747 103.7681 123.5468 152.0043 165.4152 229.3964 241.7559 286.3493 317.9690 364.8130 409.6267 430.0860 466.5940 476.1943 505.6592 534.2433 549.1374 551.3276 575.6062 587.4858 595.3827 608.2749 664.6529 700.6220 707.2186 769.6061 773.8009 803.9573 843.9033 872.4034 875.4060 895.6513 950.2192 968.2015 1002.5266 1028.3703 1045.2228 1097.7544 1137.7393 1154.9942 1164.1614 1171.1462 1205.7916 1246.1751 1269.0032 1273.4489 1289.9175 1296.6345 1348.7250 1398.3640 1403.9479 1424.2188 1471.2330 1507.1136 1537.6050 1586.1546 1610.2152 1619.9046 1635.4800 1680.3247 2924.8432 3120.5258 3141.9802 3148.5658 3154.9264 3170.8145 3470.3756 3529.0557 3558.1549 3613.1606
redmass: 4.7417 6.7725 4.7852 5.6715 2.5180 1.9261 4.0848 4.4568 4.6084 6.3455 7.2400 4.9482 3.1830 3.6750 4.3019 7.7579 5.4965 3.5763 3.3025 3.1963 2.7450 1.6533 1.2032 2.4053 3.5046 5.5902 3.7543 1.5215 6.0640 3.6090 3.4643 4.9265 1.5694 1.4511 6.1742 1.3662 1.3324 2.0975 2.8916 2.3684 2.1073 1.7042 1.7045 1.1333 2.4656 1.7823 1.5573 1.6292 1.6235 1.8854 2.1806 2.1328 6.2493 2.1500 2.7834 3.3744 7.8934 4.2226 1.2798 6.9316 5.6728 4.2020 1.0818 1.0883 1.0886 1.0935 1.0936 1.1002 1.0459 1.0641 1.0780 1.0983
irintensity: 3.4839 0.7603 4.4940 5.9206 8.3243 28.5309 2.9512 4.1647 1.2416 10.3462 5.7739 5.5652 6.8007 5.7550 6.5492 1.6534 4.1473 4.6944 23.6499 25.3016 57.9869 394.7478 71.2990 22.6285 116.1401 11.7981 20.9376 103.5454 6.8726 1.0552 2.3322 3.2227 0.1541 7.8033 1.5706 2.0859 0.3990 7.9799 260.9672 9.4239 3.4639 45.2972 5.4057 0.9307 12.9218 0.3485 4.8028 3.5661 7.1292 4.4304 24.6988 9.5533 27.2015 5.1688 69.9845 118.2273 125.3268 2.9238 157.2002 60.9819 57.1315 213.8020 46.4929 7.1914 10.8847 8.5302 6.7312 25.1159 24.2822 30.5129 56.6786 13.5115
temp: 298.150 k
press: 1.00000 atm
elementType: 8 8 8 7 7 6 6 6 6 6 6 6 6 6 6 6 1 1 1 1 1 1 1 1 1 1
symmnumber: 1
zpe: 512679.0 jmol-1
zpe.correction: 0.195269 hartree
zpe.thermalcorrener: 0.209232 hartree
zpe.thermalcorrenthalpy: 0.210176 hartree
zpe.thermalcorrgfe: 0.153923 hartree
zpe.sumelectzpe: -759.223870 hartree
zpe.sumelectthermal: -759.209908 hartree
zpe.sumelectthermalent: -759.208963 hartree
zpe.sumelectthermalfe: -759.265216 hartree
dipole: -5.8120 5.0230 1.4251
dipole: 7.8129
quadrupole: -93.1412 -81.4432 -90.1898
quadrupole: 0.1129 5.3181 -0.8848
quadrupole: -4.8831 6.8149 -1.9317 0.1129 5.3181 -0.8848
hfenergy: -759.4191394 hartree
pointgroup: C01 [X(C11H10N2O3)]
dipole: 2.2207844 -2.115835 0.1993221 debye
dipolederiv: -0.8157665 0.21798 0.0260986 0.3597341 -0.8970248 -0.0164714 0.0534616 -0.0255284 -0.3476949 -0.4542717 -0.0250015 -0.1296366 -0.0801117 -0.3092708 0.2065056 0.0326255 0.2308695 -1.1537374 -0.8799326 0.3034701 -0.1239653 0.4889807 -0.5717796 0.1705428 0.1207012 -0.0307143 -0.6014522 -1.1260058 0.1576292 -0.0771391 -0.2727062 -0.5366872 -0.057099 -0.0759409 0.0032664 -0.2435161 -0.937093 -0.0913444 -0.287762 -0.1959705 -0.3387778 -0.043326 -0.349627 0.0684145 -0.6110402 0.1160732 -0.1980954 -0.037155 0.1278474 -0.6283291 -0.0293083 0.0819435 -0.0702235 -0.1787482 0.4170502 0.1576261 0.1666432 0.3038298 0.1374281 -0.3271272 0.150919 -0.1732801 0.3772179 -0.4177598 0.2249364 0.0047843 -0.1012105 -0.1146624 -0.0245455 -0.0577812 0.0109815 -0.02213 0.4322977 0.3131937 0.0590798 0.5053347 0.3863661 0.0843098 0.0444473 0.0442666 0.0878302 0.8304544 -0.0944348 0.0232597 -0.5030754 1.0281827 0.065909 0.0499028 0.0698493 0.1621247 0.8509733 -0.4335945 0.0571259 -0.2724469 0.3946118 0.021584 0.0712522 -0.0458864 -0.0600434 0.051977 -0.1497909 0.0002857 0.134748 0.0386095 0.0129675 0.0170287 -0.0034406 -0.1007051 -0.1937649 -0.25424 -0.021176 -0.1268357 -0.008509 -0.0050012 -0.0061266 -0.0148134 -0.1935443 1.0595018 -0.4725582 0.109296 -0.5166051 0.6863705 -0.182576 -0.2681757 -0.072072 1.3765043 -0.1728906 0.2103675 0.0190293 0.0995651 -0.0038904 0.0107106 0.005574 0.0272479 -0.174546 0.1337122 -0.0090828 0.0235012 -0.0756331 0.1650741 0.0177591 0.0191382 0.0149716 -0.1287217 0.0185465 -0.0070676 0.0158108 -0.0837834 -0.1289376 0.1118133 0.0061322 0.0563609 -0.0207736 0.054355 -0.0820519 -0.0130127 -0.0687627 -0.0257345 -0.0141107 -0.0237787 -0.0072825 0.1494856 0.1211758 0.0259077 -0.0192797 -0.0302335 0.2242685 -0.0049738 -0.0162109 -0.0013995 0.3238703 0.1124392 0.0810518 -0.0019899 0.0066562 0.0241937 -0.0064289 -0.004615 -0.0010784 0.1488056 0.057552 0.0260184 -0.0074495 0.0897814 -0.1040509 -0.0070201 -0.0057299 -0.011329 0.169485 0.0008252 -0.0918941 -0.0182604 -0.1050617 -0.0395232 -0.0199231 -0.0171523 -0.0185338 0.1633183 -0.1245551 0.0220412 -0.0232078 0.0230802 0.0956502 -0.0011888 -0.0237852 -0.0012673 0.1535962 0.2270513 0.0955513 0.1792681 0.1377461 0.1981808 0.0748341 0.1843026 0.0165263 0.1798836 0.3569497 -0.033226 0.0221505 0.0040801 0.1178425 0.0520833 0.0391821 -0.0312119 0.2374137 0.2811053 0.1066089 0.053701 0.1510525 0.2103989 -0.089919 -0.0276875 -0.0346935 0.3071177 unknown
polarizability: 207.9525683|-7.426062|146.7983854|11.537558|4.2928595|82.6650343 unknown
InChI: InChI=1S/C11H10N2O3/c12-9(11(15)16)7-5-13-8-4-2-1-3-6(8)10(7)14/h1-5,9,13,15H,12H2
charge 0 multiplicity 1
26 atoms
O  -0.750532 1.710359 -0.077694
O  -2.752877 -0.064052 1.849209
O  -3.940971 1.212152 0.311311
N  1.090754 -2.006898 -0.153757
N  -2.847564 -0.143877 -1.824029
C  -0.934419 -0.679855 -0.281587
C  -2.44426 -0.603447 -0.487026
C  1.302815 0.415635 -0.011236
C  1.911908 -0.877687 -0.025814
C  -0.171545 0.567663 -0.125618
C  -0.285115 -1.899989 -0.27416
C  2.135721 1.558735 0.125116
C  3.322692 -1.015374 0.092063
C  -3.11569 0.309318 0.55059
C  3.527975 1.426823 0.239864
C  4.120418 0.132114 0.223122
H  -2.855507 -1.618916 -0.289003
H  -0.832667 -2.844198 -0.35947
H  1.525432 -2.930532 -0.151845
H  1.644202 2.537238 0.137378
H  3.780413 -2.012326 0.08082
H  4.160885 2.314059 0.342626
H  5.207096 0.027362 0.313669
H  -2.190336 -0.382733 -2.569064
H  -3.161764 0.831814 -1.836735
H  -3.192664 0.551512 2.494969
