program: Gaussian 09
title: 000190922
version: EM64L-G09RevD.01
frameworkgroup: C1[X(C15H10O6)]
method: RPBEPBE
basis: SDD
operation: Freq
keyword: #pfreq=noraman
keyword: PBEPBE/SDD
title: #p freq=noraman PBEPBE/SDD
converged: YES YES NO NO
title: Mulliken charges:
elementType: O O O O O O C C C C C C C C C C C C C C C H H H H H H H H H H
charge: -0.257984 -0.221845 -0.400812 -0.374179 -0.170063 -0.425610 0.153795 0.233067 0.063090 0.192630 -0.047522 -0.204038 0.216960 0.437694 0.136631 -0.597601 0.115129 -0.583344 -0.602757 0.327297 -0.858023 0.253109 0.257291 0.256983 0.260572 0.218177 0.292710 0.237509 0.362150 0.367743 0.361241
chargesum: 0.00000
title: Mulliken charges with hydrogens summed into heavy atoms:
elementType: O O O O O O C C C C C C C C C C C C C C C
charge: -0.257984 -0.221845 -0.038662 -0.006436 -0.170063 -0.064369 0.153795 0.233067 0.063090 0.192630 -0.047522 0.049071 0.216960 0.437694 0.136631 -0.340309 0.115129 -0.326361 -0.342186 0.327297 -0.109628
polarizability: 3.17992206e+02 1.15543846e+01 1.94579117e+02 2.76557265e+00 -5.66955624e+00 8.31196763e+01
1716.lowfreq: -7.8892 -3.5558 -0.0010 -0.0004 -0.0003 6.1029 48.1271 68.7068 88.8276
frequency: 48.1202 68.7050 88.8258 130.7933 146.2015 152.3050 183.3527 210.9647 223.6341 238.6428 263.7287 275.6686 282.8722 298.6563 323.9339 324.6897 358.7824 364.1618 386.5119 396.9198 418.7174 451.0174 462.2717 517.1896 528.1261 540.2483 544.9985 578.9949 604.6050 609.8385 617.1108 621.0354 666.2350 696.1372 714.5196 737.5636 743.2534 757.9840 801.5862 817.3651 832.9709 875.9780 879.8831 921.1477 950.1109 966.6916 985.2795 990.9302 1033.5643 1043.7959 1054.5824 1102.1364 1129.7760 1152.6734 1156.2287 1198.9596 1223.9067 1231.7437 1255.1184 1272.2354 1291.2401 1310.0947 1368.1884 1406.9613 1408.6794 1414.7391 1436.1725 1443.4540 1468.1588 1475.0511 1494.2925 1504.2371 1582.5032 1602.6037 1631.9388 1652.3190 1718.3999 2975.6764 3059.6161 3093.9564 3108.7199 3156.6956 3158.4685 3165.6087 3545.5891 3570.6202 3585.4804
redmass: 6.2711 6.6338 7.9783 8.1181 7.2503 5.9576 5.2221 3.0028 4.1196 1.3093 3.7612 5.4664 5.2173 2.1335 3.2256 5.5602 1.1684 2.3332 1.2085 7.1393 7.2520 5.3766 6.7554 7.1322 5.6984 3.6397 5.2636 7.9814 7.1431 4.7158 6.0267 4.3771 5.7107 4.6766 6.3324 6.7642 5.6095 6.5601 8.4707 1.6064 1.5636 1.4598 7.8751 6.7889 4.0093 6.2031 4.9341 4.4139 2.9546 2.6563 1.5640 3.4344 1.7764 1.3170 1.4578 2.1069 1.4414 2.0164 1.7593 1.9002 5.0417 6.2188 1.1662 3.7641 2.4722 1.8537 2.9881 5.4412 6.9916 1.0865 3.5025 1.2320 8.0436 8.7631 8.0169 8.1897 12.9434 1.0393 1.0955 1.0989 1.0866 1.0928 1.0935 1.0920 1.0659 1.0662 1.0662
irintensity: 0.6786 0.1785 1.5945 0.6515 0.8912 0.2256 2.5073 7.9100 0.5945 0.3290 2.2600 1.3516 2.4770 21.7262 70.9934 9.7289 112.4502 69.9131 137.2786 1.9174 6.0093 33.3611 20.2367 26.8278 0.7421 2.6633 1.8491 0.8868 10.7541 7.6791 17.1346 0.9124 21.3957 5.4380 23.2031 0.9338 7.6511 1.6117 52.2880 26.4129 58.7021 20.3120 130.0992 111.6166 67.7479 54.5565 17.9955 39.6971 138.2492 26.7569 11.8965 92.3973 421.9194 105.0608 14.7145 55.8684 16.6487 98.2728 64.4056 5.1624 10.9247 77.4504 33.5590 14.6888 6.1405 9.5573 17.2498 100.0991 25.3498 17.4494 21.9693 68.4732 145.6898 41.7743 224.6024 72.0038 495.2458 17.0630 17.4360 16.7442 8.8813 2.8363 2.6364 5.5183 14.5664 72.1460 72.0105
temp: 298.150 k
press: 1.00000 atm
elementType: 8 8 8 8 8 8 6 6 6 6 6 6 6 6 6 6 6 6 6 6 6 1 1 1 1 1 1 1 1 1 1
symmnumber: 1
zpe: 574706.6 jmol-1
zpe.correction: 0.218894 hartree
zpe.thermalcorrener: 0.236075 hartree
zpe.thermalcorrenthalpy: 0.237019 hartree
zpe.thermalcorrgfe: 0.175272 hartree
zpe.sumelectzpe: -1027.477533 hartree
zpe.sumelectthermal: -1027.460352 hartree
zpe.sumelectthermalent: -1027.459408 hartree
zpe.sumelectthermalfe: -1027.521155 hartree
dipole: 5.5880 -4.8917 0.7456
dipole: 7.4639
quadrupole: -141.6559 -106.4375 -118.0611
quadrupole: 6.3702 -3.1813 -1.9587
quadrupole: -19.6044 15.6140 3.9904 6.3702 -3.1813 -1.9587
hfenergy: -1027.6964273 hartree
pointgroup: C01[X(C15H10O6)]
dipole: 2.1783188 1.9337787 -0.3724249 debye
polarizability: 318.1773131|-10.5024436|193.8182396|-3.3653852|-9.6190877|83.695446 unknown
InChI: InChI=1S/C15H10O6/c1-5-2-6(16)3-8-10(5)12-9(20-8)4-7(17)11-13(12)15(19)21-14(11)18/h2-4,15-17,19H,1H3
charge 0 multiplicity 1
31 atoms
O  1.150188 2.180525 -0.195149
O  -3.039607 -2.084487 0.301744
O  -1.125094 -2.745116 -0.994887
O  -3.766797 2.225668 -0.035482
O  -4.838185 -0.586787 0.271432
O  5.650997 0.16841 -0.046637
C  -0.01329 0.156651 0.055724
C  -1.249992 -0.52066 0.123026
C  1.428831 -0.143187 0.076417
C  -0.117755 1.582114 -0.092794
C  -2.475637 0.190067 0.099638
C  -1.564859 -2.012748 0.172189
C  2.082615 1.113112 -0.093841
C  2.250924 -1.302123 0.247532
C  -2.522115 1.605385 -0.023705
C  -1.304757 2.320899 -0.135962
C  -3.614188 -0.755659 0.223051
C  3.464116 1.313948 -0.148223
C  3.650646 -1.125287 0.189594
C  4.249389 0.14598 -0.010335
C  1.693389 -2.683533 0.518011
H  -1.130602 -2.559873 1.020016
H  -1.274697 3.409603 -0.245738
H  3.891275 2.312162 -0.284197
H  4.316372 -1.984703 0.311323
H  1.171436 -2.713731 1.494068
H  0.96978 -2.993751 -0.255889
H  2.502361 -3.431342 0.556698
H  -1.518081 -2.340238 -1.811103
H  -3.679673 3.209033 -0.112765
H  5.993314 1.086464 -0.182756
