program: Gaussian 09
title: 000190916
version: EM64L-G09RevD.01
frameworkgroup: C1[X(C15H19N)]
method: RPBEPBE
basis: SDD
operation: Freq
keyword: #pfreq=noraman
keyword: PBEPBE/SDD
title: #p freq=noraman PBEPBE/SDD
converged: YES YES NO NO
title: Mulliken charges:
elementType: N C C C C C C C C C C C C C C C H H H H H H H H H H H H H H H H H H H
charge: -0.096360 -0.105822 -0.510782 -0.514962 -0.386066 -0.368098 -0.519444 0.497277 -0.463458 -0.735380 0.501309 -0.388058 -0.449606 -0.223206 -0.220470 -0.250861 0.226827 0.231391 0.237625 0.238938 0.229457 0.182905 0.223589 0.229876 0.186085 0.199403 0.239891 0.218194 0.229805 0.211191 0.247326 0.228406 0.223424 0.223295 0.226360
chargesum: 0.00000
title: Mulliken charges with hydrogens summed into heavy atoms:
elementType: N C C C C C C C C C C C C C C C
charge: -0.096360 0.121004 -0.041766 -0.046568 0.020428 0.047863 -0.080150 0.497277 -0.245264 -0.294383 0.501309 -0.140732 -0.221200 0.000218 0.002825 -0.024501
polarizability: 2.01905317e+02 7.89934058e+00 1.47298709e+02 2.42083634e+01 -5.45687778e+00 1.33187681e+02
1716.lowfreq: -13.5716 -5.1399 -0.0002 0.0005 0.0007 1.8433 25.4960 29.5550 42.0440
frequency: 25.4323 29.2684 41.9572 90.3108 96.9197 154.8614 167.4020 203.5578 249.5834 252.3000 292.7354 330.7502 364.5731 405.5768 425.7808 451.4181 457.1351 482.7570 522.1633 598.3285 616.1956 669.2793 705.3975 730.3202 762.3405 768.1870 782.5718 806.2698 824.7728 834.4313 856.1742 869.7208 892.3572 916.2457 938.3301 965.3987 978.1052 988.6345 990.6167 994.6738 997.0457 1009.8058 1025.7697 1038.5150 1058.6171 1063.2521 1072.9227 1081.4079 1101.1433 1152.0756 1163.5786 1167.5675 1169.6179 1171.0410 1184.5631 1186.6678 1205.3307 1207.9175 1221.0966 1240.4363 1273.5885 1280.3734 1319.2440 1333.8511 1334.5864 1357.2555 1371.2272 1381.1435 1389.9076 1426.2040 1438.5959 1449.1890 1454.5359 1459.5872 1463.9485 1476.1116 1481.4827 1592.0618 1612.2711 1693.7567 2802.7312 2848.9232 2957.0584 2961.1349 2971.5337 2988.3624 3009.6517 3021.2342 3040.9067 3096.2390 3102.7933 3106.1444 3112.3543 3117.1110 3130.6400 3141.0321 3159.7991 3198.9902 3215.9791
redmass: 3.7622 4.0955 3.2779 3.9961 2.9372 2.6208 2.7377 3.8072 2.4592 3.7302 2.1944 2.1617 3.5961 2.8281 2.5725 2.6557 2.4462 3.0294 4.4805 4.1170 6.0775 3.1400 1.9715 2.1143 1.8678 2.1574 1.2361 2.0302 1.3571 1.6354 1.2503 3.2661 2.0014 1.7437 2.3464 2.2239 1.3909 2.0747 4.0934 1.4316 1.9567 2.0830 2.2139 1.2127 2.1988 1.2748 1.7157 1.6179 1.2107 1.8994 1.4696 1.4470 1.5471 1.1990 1.5290 1.1141 1.9434 1.6875 1.5465 1.6007 1.3393 1.5275 1.3557 1.3610 1.3173 2.2069 1.9752 7.5594 1.4076 1.0913 2.0479 1.1061 1.1344 1.3596 1.1001 1.1072 2.1995 6.1068 6.0676 7.0873 1.0719 1.0716 1.0593 1.0856 1.0607 1.0838 1.1001 1.0981 1.0893 1.0507 1.0910 1.0627 1.0863 1.0865 1.0911 1.0959 1.1014 1.1172 1.1155
irintensity: 0.0562 0.0955 0.2012 0.0768 0.1230 0.0962 0.7704 2.0524 1.5086 0.3939 6.4165 1.1464 3.1179 0.0920 0.1943 1.8675 5.5041 8.7320 0.2297 8.9534 0.8334 4.9141 42.3177 33.3670 10.2023 24.7049 3.4517 5.2626 10.1083 7.1825 0.3119 19.5775 1.0664 3.1078 8.8299 12.5527 0.2144 4.4274 3.2421 0.0744 2.4927 3.1297 9.6331 37.5037 5.1181 3.8260 4.9471 8.5869 0.1397 8.8755 2.3103 9.4705 3.5677 4.2199 5.2124 0.8294 0.4095 9.5125 9.8769 10.6596 11.7983 1.9113 10.0917 2.4249 1.3312 58.4240 3.2374 0.4378 1.6501 8.8792 6.9738 8.3420 17.7504 21.6386 3.1684 7.3799 18.8470 0.7791 11.8050 1.2943 98.8182 107.0245 31.8917 105.1787 39.3335 28.9405 17.4379 29.5982 34.7971 21.5057 29.8913 10.9082 8.5929 1.4190 10.7137 45.0971 28.5557 0.2478 34.0150
temp: 298.150 k
press: 1.00000 atm
elementType: 7 6 6 6 6 6 6 6 6 6 6 6 6 6 6 6 1 1 1 1 1 1 1 1 1 1 1 1 1 1 1 1 1 1 1
symmnumber: 1
zpe: 787278.9 jmol-1
zpe.correction: 0.299859 hartree
zpe.thermalcorrener: 0.314505 hartree
zpe.thermalcorrenthalpy: 0.315449 hartree
zpe.thermalcorrgfe: 0.256417 hartree
zpe.sumelectzpe: -636.497906 hartree
zpe.sumelectthermal: -636.483260 hartree
zpe.sumelectthermalent: -636.482316 hartree
zpe.sumelectthermalfe: -636.541348 hartree
dipole: -0.5550 -0.7401 0.3416
dipole: 0.9862
quadrupole: -90.9178 -93.9273 -94.0454
quadrupole: 2.5874 2.7999 -1.5531
quadrupole: 2.0457 -0.9638 -1.0819 2.5874 2.7999 -1.5531
hfenergy: -636.7977651 hartree
pointgroup: C01 [X(C15H19N1)]
dipole: 0.2336063 0.2795565 0.1334443 debye
polarizability: 197.7023638|9.2896305|146.3434672|-28.9441263|5.8194975|138.3458757 unknown
InChI: InChI=1S/C15H19N/c1-2-4-13(5-3-1)12-14-8-10-16(11-9-14)15-6-7-15/h1-5,8,15H,6-7,9-12H2
charge 0 multiplicity 1
35 atoms
N  2.666318 0.053248 -0.127329
C  4.081307 -0.271924 -0.120256
C  4.595134 -1.287328 -1.148488
C  4.501933 -1.670684 0.338913
C  2.122145 0.402523 1.206598
C  2.322081 1.058715 -1.158053
C  0.581167 0.409993 1.16282
C  0.061579 1.217176 -0.018283
C  0.88092 1.513548 -1.062677
C  -1.386646 1.686333 0.030778
C  -2.41818 0.557477 0.130926
C  -2.321425 -0.59051 -0.697855
C  -3.50933 0.651634 1.030754
C  -3.294677 -1.612121 -0.633958
C  -4.486407 -0.368465 1.098036
C  -4.382985 -1.505159 0.264193
H  4.776003 0.554037 0.132523
H  5.584341 -1.130769 -1.588582
H  3.849976 -1.727202 -1.817364
H  3.69868 -2.356913 0.621923
H  5.427847 -1.773995 0.912274
H  2.486793 1.404472 1.551611
H  2.48539 -0.347678 1.931689
H  2.512536 0.612823 -2.154741
H  2.989626 1.96147 -1.093162
H  0.180887 0.827951 2.109408
H  0.206141 -0.630103 1.096715
H  0.50806 2.118422 -1.901365
H  -1.598045 2.289841 -0.875134
H  -1.52655 2.36276 0.899343
H  -1.474027 -0.678511 -1.388964
H  -3.59527 1.530316 1.682858
H  -3.204885 -2.491838 -1.281935
H  -5.323422 -0.277376 1.799993
H  -5.137813 -2.298063 0.314788
