program: Gaussian 09
title: 000190973
version: EM64L-G09RevD.01
frameworkgroup: C1[X(C19H24N2O3)]
method: RPBEPBE
basis: SDD
operation: Freq
keyword: #p
keyword: freq=noraman
keyword: PBEPBE/SDD
title: #p freq=noraman PBEPBE/SDD
converged: YES YES NO NO
title: Mulliken charges:
elementType: O O O N N C C C C C C C C C C C C C C C C C C C H H H H H H H H H H H H H H H H H H H H H H H H
charge: -0.291532 -0.215853 -0.224045 -0.053864 -0.408183 -0.146181 -0.158471 -0.444031 -0.446331 -0.511254 -0.483241 0.034140 -0.644933 0.069929 0.240436 -0.604921 0.065108 -0.735382 0.414349 0.262566 -0.431563 -0.400879 -0.255497 -0.216390 0.235212 0.234284 0.198464 0.229460 0.230107 0.206706 0.221232 0.222064 0.216816 0.249071 0.251398 0.226651 0.189763 0.227945 0.254842 0.237298 0.228191 0.221691 0.254833 0.323019 0.235727 0.232745 0.229034 0.229470
chargesum: 0.00000
title: Mulliken charges with hydrogens summed into heavy atoms:
elementType: O O O N N C C C C C C C C C C C C C C C C C C C
charge: -0.291532 -0.215853 -0.224045 -0.053864 -0.085164 0.089031 0.075814 -0.016107 -0.009519 -0.067958 -0.017354 0.285537 -0.000573 0.069929 0.240436 -0.112780 0.065108 -0.030667 0.414349 0.262566 -0.195837 -0.168134 -0.026463 0.013080
polarizability: 2.14899579e+02 2.80976756e+00 2.48587464e+02 2.22979012e+01 -1.23885445e+00 1.86971572e+02
1716.lowfreq: -9.3705 -1.7092 -0.0008 -0.0006 -0.0005 5.9515 9.7207 22.5409 45.0079
frequency: 5.2768 22.3913 44.9893 60.4538 70.2376 83.8905 114.8960 150.1097 170.2814 174.0102 180.1705 196.0930 210.8318 230.6138 245.6966 273.6499 276.1146 289.3481 313.3186 320.0679 345.4086 365.7413 369.6839 402.4184 427.5261 442.1357 445.1552 473.7832 485.1727 510.9293 540.3218 545.1138 562.2078 618.1027 646.6408 654.4250 666.3145 711.7796 718.4988 727.6635 733.7523 748.4068 762.0874 776.1064 787.1833 792.6058 816.0746 832.8358 861.9086 864.4174 873.7604 896.9499 912.0718 926.6402 937.9598 950.0762 963.2287 969.2710 971.0201 979.3528 997.0698 1030.6452 1034.2970 1040.2848 1074.4706 1085.6844 1092.3748 1115.1036 1117.3189 1125.5630 1141.1278 1145.2398 1150.0766 1169.2747 1173.3880 1174.6119 1197.7762 1210.4758 1217.1183 1219.4512 1229.7282 1246.5709 1251.3896 1257.5096 1272.3130 1276.1140 1276.8982 1298.6383 1300.2348 1310.4960 1317.0625 1333.3224 1342.7385 1353.3602 1356.4818 1373.2165 1386.9283 1416.6037 1427.9112 1449.0497 1457.0386 1459.2724 1465.6656 1468.7379 1470.3529 1476.8125 1481.2849 1487.1810 1493.2716 1495.4687 1600.9059 1613.3405 1621.8784 1638.1201 2876.7693 2968.1954 2992.7033 2994.7424 3000.8856 3009.5949 3012.9378 3020.1329 3026.7425 3028.3708 3037.3580 3055.6184 3065.5537 3068.1257 3069.3238 3071.5974 3092.2984 3099.5967 3117.5938 3121.7929 3126.2671 3144.6614 3166.3012 3519.4869
redmass: 3.8713 4.9308 4.0472 5.9155 7.9137 4.2892 6.6957 4.4011 3.6981 2.1582 3.6107 1.0987 1.0453 3.0064 3.2244 3.2353 2.4312 3.7659 4.6668 3.8205 2.9566 2.8835 2.2358 4.3871 5.4911 2.6761 3.6460 5.0856 3.7779 4.5530 3.2642 3.3809 4.9794 4.7044 3.9301 2.1094 3.3034 4.1342 2.9022 3.9804 4.5452 4.1994 1.4666 2.6804 2.5163 2.9035 2.4290 2.6238 2.0530 1.6609 1.5830 4.4523 3.5937 3.5868 1.4671 1.8866 2.1948 2.0964 1.7145 1.3541 1.7534 2.3301 2.2092 1.5305 2.4858 1.7747 3.2523 1.1787 1.4173 2.2486 2.0519 1.8443 1.7529 1.4445 1.1596 2.5343 1.5991 2.1877 3.3275 1.9622 1.5257 1.3423 1.6001 1.4541 1.4314 1.4490 1.5194 1.4830 2.4595 1.3644 1.3291 1.5789 2.1905 1.5313 1.4253 2.8540 1.2226 2.4351 1.1501 1.1287 1.0819 1.0735 1.2266 1.0801 1.9255 1.0755 1.0862 1.0930 1.0522 2.7618 7.4244 10.2499 6.8828 6.2454 1.0550 1.0675 1.0610 1.0621 1.0352 1.0609 1.0736 1.0686 1.0853 1.0863 1.0843 1.1006 1.1006 1.1034 1.1007 1.0934 1.1042 1.0994 1.1014 1.0869 1.0896 1.0931 1.1004 1.0762
irintensity: 0.0575 0.3076 0.0635 0.5177 0.9150 1.2602 1.5713 1.1780 5.5695 0.3933 0.3211 0.3595 0.2610 0.9615 0.1049 2.3063 0.9522 2.8882 8.3963 4.1960 1.5173 3.7257 0.2808 1.8116 15.8219 12.7110 9.1805 8.3654 1.2431 0.4665 10.6573 1.4754 5.4200 12.2234 25.5046 48.8030 8.9826 9.8078 0.3331 1.8236 1.6440 17.1128 105.4905 2.3183 8.1522 23.8136 6.3130 5.2843 17.1599 4.1720 2.0451 14.9079 13.3149 47.0192 1.5127 10.3621 30.4985 6.1519 3.5987 0.1987 0.8726 89.4890 2.7058 10.5883 260.5060 9.6801 54.6410 7.3675 0.7652 49.2672 35.0187 76.0025 19.0701 1.1838 0.1751 12.6711 3.0961 14.7824 29.6229 29.1250 4.6192 10.6673 31.2735 1.2984 0.0163 10.2138 29.6633 7.0427 111.2189 5.4193 0.8077 17.6914 34.7125 3.1417 5.1185 4.8551 34.1561 0.9206 7.3423 14.2886 10.1203 9.3008 15.4164 8.4145 27.0821 19.2995 23.6737 9.7295 1.6070 70.2812 61.3840 113.2052 22.0238 389.2965 97.1086 23.6399 12.8051 24.7975 20.9211 9.7672 62.7113 46.7904 87.7942 12.7003 9.3962 33.3700 29.8525 0.5974 26.8074 7.4954 67.2899 23.3233 7.8377 9.4683 3.6466 21.7647 24.5972 26.2342
temp: 298.150 k
press: 1.00000 atm
elementType: 8 8 8 7 7 6 6 6 6 6 6 6 6 6 6 6 6 6 6 6 6 6 6 6 1 1 1 1 1 1 1 1 1 1 1 1 1 1 1 1 1 1 1 1 1 1 1 1
symmnumber: 1
zpe: 1048832.3 jmol-1
zpe.correction: 0.399479 hartree
zpe.thermalcorrener: 0.421085 hartree
zpe.thermalcorrenthalpy: 0.422029 hartree
zpe.thermalcorrgfe: 0.347190 hartree
zpe.sumelectzpe: -1071.830854 hartree
zpe.sumelectthermal: -1071.809248 hartree
zpe.sumelectthermalent: -1071.808304 hartree
zpe.sumelectthermalfe: -1071.883142 hartree
dipole: 1.4664 3.3847 2.3123
dipole: 4.3535
quadrupole: -141.1018 -145.5866 -138.5957
quadrupole: -14.4941 2.4622 -6.9297
quadrupole: 0.6596 -3.8252 3.1657 -14.4941 2.4622 -6.9297
hfenergy: -1072.2303326 hartree
pointgroup: C01 [X(C19H24N2O3)]
dipole: -0.4322348 -1.4880447 0.7297555 debye
polarizability: 212.931624|3.2257875|247.8465626|-23.0878322|7.6095192|189.6804289 unknown
InChI: InChI=1S/C19H24N2O3/c1-19(11-12-5-3-4-6-16(12)20-17(19)22)18(23)24-15-9-13-7-8-14(10-15)21(13)2/h3-6,13-15,20H,7-11H2,1-2H3
charge 0 multiplicity 1
48 atoms
O  -0.653141 0.902045 0.757906
O  0.277406 1.524454 -1.287752
O  3.080771 3.254285 -0.422048
N  -4.243316 -1.323975 0.302744
N  3.454951 0.999088 -0.792542
C  -4.3999 0.11874 0.642663
C  -3.371202 -1.283688 -0.905476
C  -4.820474 0.705835 -0.738115
C  -4.127264 -0.24097 -1.782882
C  -3.055551 0.738066 1.154238
C  -1.92137 -0.807586 -0.554047
C  -1.968613 0.599337 0.07631
C  -3.900932 -2.26155 1.380122
C  1.648772 1.630293 0.798049
C  0.383755 1.354713 -0.051997
C  2.066748 0.331932 1.552809
C  2.777744 2.053857 -0.179626
C  1.360842 2.780563 1.793698
C  2.496613 -0.765197 0.597336
C  3.214464 -0.381347 -0.569408
C  2.257674 -2.135802 0.826231
C  3.703477 -1.355879 -1.471197
C  2.739993 -3.119342 -0.069089
C  3.468654 -2.72379 -1.214932
H  -5.180737 0.247641 1.413558
H  -3.326132 -2.281584 -1.37758
H  -4.510486 1.760668 -0.849138
H  -5.917048 0.6637 -0.844605
H  -4.882773 -0.751749 -2.402472
H  -3.44179 0.299073 -2.460046
H  -3.196558 1.802526 1.418326
H  -2.731868 0.211109 2.072171
H  -1.464516 -1.515448 0.16483
H  -1.287828 -0.79526 -1.458689
H  -2.089968 1.35938 -0.716833
H  -4.680868 -2.215061 2.161976
H  -2.915014 -2.086673 1.875633
H  -3.892529 -3.289816 0.974863
H  1.229522 0.000756 2.189472
H  2.910315 0.596226 2.224785
H  0.515984 2.510112 2.448376
H  2.254835 2.97213 2.413013
H  1.126092 3.71173 1.253491
H  4.121594 1.273771 -1.519863
H  1.698633 -2.436236 1.720718
H  4.252375 -1.047622 -2.369155
H  2.551309 -4.18037 0.12449
H  3.847156 -3.477581 -1.913818
