program: Gaussian 09
title: 000182560
version: EM64L-G09RevD.01
frameworkgroup: C1[X(C19H28N2O2)]
method: RPBEPBE
basis: SDD
operation: Freq
keyword: #p
keyword: freq=noraman
keyword: PBEPBE/SDD
title: #p freq=noraman PBEPBE/SDD
converged: YES YES NO NO
title: Mulliken charges:
elementType: O O N N C C C C C C C C C C C C C C C C C C C H H H H H H H H H H H H H H H H H H H H H H H H H H H H
charge: -0.266357 -0.266209 -0.089811 -0.074375 -0.427414 0.470011 0.306324 0.391088 -0.585067 -0.634880 -0.367112 -0.546166 -0.368360 -0.572624 -0.628399 -0.360422 0.183631 0.182242 -0.353545 -0.206381 -0.687796 -0.623126 -0.612066 0.244911 0.208665 0.222620 0.263296 0.242469 0.209738 0.261646 0.195931 0.209048 0.267838 0.198639 0.218890 0.224504 0.208672 0.185481 0.213446 0.190789 0.227820 0.238764 0.216784 0.207006 0.206933 0.239054 0.218598 0.184777 0.223953 0.186106 0.220435
chargesum: 0.00000
title: Mulliken charges with hydrogens summed into heavy atoms:
elementType: O O N N C C C C C C C C C C C C C C C C C C C
charge: -0.266357 -0.266209 -0.089811 -0.074375 -0.182503 0.470011 0.306324 0.391088 -0.153781 -0.371584 0.085095 -0.284519 0.036619 -0.304785 0.013634 0.033730 0.183631 0.182242 0.050690 0.260204 -0.057073 0.019303 0.018427
polarizability: 2.96773826e+02 2.86765917e+01 2.04895954e+02 5.01775197e+00 -1.09936841e+01 1.96818095e+02
1716.lowfreq: -5.6829 -0.0004 0.0002 0.0005 1.7332 9.1147 23.3240 25.1688 30.0566
frequency: 23.2284 24.8995 29.8301 32.8585 41.4855 66.2730 79.1881 81.0999 99.0422 110.3647 128.9597 142.1474 153.0236 179.6021 205.7013 209.6850 223.2795 228.3416 239.3430 250.4409 257.3549 271.6523 285.9825 318.6235 325.3537 352.9370 361.9118 378.8707 399.0529 400.9659 412.0285 442.5053 458.1164 516.1461 538.9939 572.7382 630.1191 652.2666 666.4596 676.4927 724.2785 740.3869 763.4449 770.5219 786.3343 806.0373 820.9625 833.5517 840.9497 851.7380 858.3881 870.8019 887.7748 894.7403 909.3760 932.4279 973.4363 989.6874 992.9999 1022.9277 1036.1743 1043.3764 1053.8058 1055.0967 1070.9610 1073.3797 1078.5453 1092.3914 1102.4669 1109.0060 1118.7170 1124.7944 1130.8189 1143.3991 1146.2046 1168.7415 1173.0626 1182.0308 1200.3328 1225.5355 1231.8066 1235.0924 1259.8996 1274.2626 1278.5332 1287.4717 1297.9718 1304.0174 1314.1440 1320.0058 1326.9721 1342.5022 1355.8154 1359.9430 1384.7900 1388.6511 1391.3211 1419.6495 1433.4608 1440.4153 1441.2262 1446.4393 1457.5197 1460.3776 1462.4788 1466.5711 1469.1715 1473.4432 1474.7868 1477.6201 1477.8554 1480.6928 1485.3289 1485.5449 1486.7953 1493.6048 1598.6251 1609.3738 1627.4502 2835.6953 2840.1932 2859.6761 2879.1884 2913.9818 2950.5781 2960.2076 2966.5662 2970.6185 2973.9377 2988.1763 3005.5834 3014.6215 3015.4307 3018.9375 3022.1883 3029.0466 3037.2859 3049.5658 3066.9750 3070.5673 3071.6342 3074.7887 3086.8879 3108.6740 3159.2983 3169.6450 3176.3259
redmass: 3.8044 3.5643 2.8110 3.9911 4.4000 3.5270 1.7404 2.5584 2.3044 2.8965 3.2866 4.1553 3.0145 2.9733 2.4751 1.3791 1.3118 1.3809 1.1997 2.0083 2.2451 2.1520 4.6619 2.9894 2.6572 5.6253 3.1628 3.1249 3.4206 3.3384 3.1505 2.7173 2.8541 3.6682 3.3050 4.0100 3.3953 5.8559 6.9483 8.8945 4.1611 1.1803 5.6923 6.1874 1.2887 2.0227 3.4938 2.2544 7.4522 2.5777 1.4722 1.6779 1.7945 1.9104 2.3112 1.4990 5.5070 3.1172 3.0347 2.3591 1.5596 2.2950 1.7949 2.0625 2.1499 1.5158 1.6997 1.4179 1.9982 1.3382 1.9297 1.7065 1.1396 1.7270 1.6222 1.8457 2.0976 1.8157 1.4926 2.2488 1.3163 1.3423 2.1234 1.7694 1.6411 1.4091 1.7801 1.2773 1.6488 1.6477 2.2552 1.4251 1.5821 1.2929 1.3668 1.2195 4.0684 1.1455 1.1891 2.7819 1.1551 1.3813 1.0808 1.0543 1.0645 1.0690 2.2111 1.0627 1.0653 1.0432 1.0696 1.0647 1.1583 1.3003 1.0841 1.0678 9.4256 7.8406 7.9474 1.0683 1.0577 1.0594 1.0545 1.0686 1.0806 1.0590 1.0573 1.0404 1.0590 1.0628 1.0984 1.0799 1.0727 1.0798 1.1002 1.0726 1.1024 1.0925 1.1008 1.0992 1.1004 1.1009 1.1000 1.1079 1.0963 1.0934 1.0929
irintensity: 0.1023 0.0025 0.5225 0.2252 0.1259 0.2512 0.7807 5.1988 5.6018 5.1782 3.1984 0.0308 0.2551 0.5837 0.6845 1.2032 0.5842 0.1594 0.4047 1.1660 1.7828 0.7139 1.3554 0.8844 2.9416 6.3741 3.7856 7.2122 2.4131 2.0754 4.7605 5.5849 4.6371 2.0889 5.0751 2.9866 24.0529 4.9753 1.1088 0.8467 7.3398 5.0187 8.4417 25.9829 2.5811 1.4745 8.2305 9.9809 27.5305 4.2863 0.9330 10.3052 23.6922 16.3107 8.3118 27.4830 155.2752 3.4527 5.3856 31.2035 38.5882 64.5975 4.9264 5.3672 5.0750 8.0193 3.2950 5.7625 1.8694 5.5608 24.0388 21.1998 8.9811 7.6404 1.9524 42.4332 42.8850 25.7697 0.4612 2.8689 0.3749 8.0853 14.0528 11.5230 40.8663 34.7657 89.8826 1.6106 42.8200 10.2323 11.4933 3.9720 4.5304 0.6419 2.4184 14.8465 87.7670 2.3158 5.1312 5.6415 1.7433 9.1207 8.2770 2.9354 21.1711 1.8213 89.5448 7.3065 3.4820 9.5153 19.7881 7.2133 21.5368 18.1359 12.1660 15.6561 2.7734 6.6988 15.0453 65.6699 68.1508 209.0384 90.1267 68.9651 19.5919 12.7349 25.4170 25.5311 84.5349 150.2545 1.7201 11.4308 40.1845 64.6532 16.1475 35.1283 57.5883 26.8426 95.6911 49.3152 39.1796 33.8189 48.1065 34.9437 17.2750 5.3300 2.3873
temp: 298.150 k
press: 1.00000 atm
elementType: 8 8 7 7 6 6 6 6 6 6 6 6 6 6 6 6 6 6 6 6 6 6 6 1 1 1 1 1 1 1 1 1 1 1 1 1 1 1 1 1 1 1 1 1 1 1 1 1 1 1 1
symmnumber: 1
zpe: 1138874.1 jmol-1
zpe.correction: 0.433774 hartree
zpe.thermalcorrener: 0.458310 hartree
zpe.thermalcorrenthalpy: 0.459254 hartree
zpe.thermalcorrgfe: 0.377360 hartree
zpe.sumelectzpe: -998.929086 hartree
zpe.sumelectthermal: -998.904550 hartree
zpe.sumelectthermalent: -998.903606 hartree
zpe.sumelectthermalfe: -998.985500 hartree
dipole: 1.1902 -0.1945 -0.0936
dipole: 1.2096
quadrupole: -131.9816 -140.1937 -135.6685
quadrupole: 3.1465 -1.1731 0.7742
quadrupole: 3.9663 -4.2458 0.2794 3.1465 -1.1731 0.7742
hfenergy: -999.3628601 hartree
pointgroup: C01 [X(C19H28N2O2)]
dipole: -0.4654054 0.098842 -0.0104996 debye
polarizability: 298.2809547|24.1782792|203.2687103|-12.5343972|9.3122028|196.9382101 unknown
InChI: InChI=1S/C19H28N2O2/c1-5-6-7-14-10-15-11-17-18(23-13-22-17)12-16(15)19(14)21(4)9-8-20(2)3/h10-12,19H,5-9,13H2,1-4H3
charge 0 multiplicity 1
51 atoms
O  4.534157 0.814847 0.962361
O  4.899605 0.092944 -1.292915
N  -1.260999 0.415013 1.181517
N  -2.73643 3.62926 -0.24597
C  -0.418129 -0.686155 0.651888
C  -0.98569 -1.29236 -0.649027
C  1.046622 -0.383271 0.271854
C  1.266163 -0.814452 -1.074272
C  -2.427271 -1.711575 -0.756769
C  0.002106 -1.366498 -1.597469
C  -1.314604 1.626498 0.326452
C  2.084941 0.182774 1.045486
C  -2.838362 -2.819407 0.257188
C  2.53346 -0.694215 -1.703829
C  -1.072719 0.708996 2.614656
C  -2.713943 2.283401 0.37265
C  3.324494 0.315185 0.402404
C  3.540067 -0.110282 -0.926842
C  -2.110867 -4.164903 0.041515
C  5.47286 0.900031 -0.185306
C  -2.542181 -5.244441 1.057868
C  -2.468277 3.607114 -1.698602
C  -3.981355 4.359166 0.067403
H  -0.418509 -1.479289 1.431319
H  -2.642965 -2.057051 -1.78691
H  -3.066475 -0.825933 -0.561296
H  -0.116049 -1.777264 -2.604431
H  -1.074202 1.320201 -0.707358
H  -0.558186 2.387368 0.629511
H  1.951939 0.496116 2.083469
H  -3.932954 -2.979348 0.178465
H  -2.652118 -2.452068 1.286492
H  2.72122 -1.035703 -2.725042
H  -0.130895 1.265085 2.841756
H  -1.067499 -0.234128 3.190222
H  -1.91189 1.322756 2.988316
H  -3.02125 2.399859 1.429187
H  -3.452118 1.585252 -0.10251
H  -1.015857 -4.006203 0.104672
H  -2.310139 -4.523614 -0.989204
H  5.549818 1.955807 -0.511173
H  6.441019 0.468022 0.109821
H  -2.011911 -6.198975 0.884786
H  -3.628605 -5.443741 0.989211
H  -2.327184 -4.92173 2.094394
H  -1.46989 3.18383 -1.900118
H  -2.478576 4.640195 -2.089836
H  -3.222097 3.01027 -2.275206
H  -4.105474 4.430758 1.162885
H  -4.900552 3.875487 -0.353358
H  -3.92315 5.385772 -0.337409
