program: Gaussian 09
title: 000182559
version: EM64L-G09RevD.01
frameworkgroup: C1[X(C18H23NO)]
method: RPBEPBE
basis: SDD
operation: Freq
keyword: #p
keyword: freq=noraman
keyword: PBEPBE/SDD
title: #p freq=noraman PBEPBE/SDD
converged: NO YES NO NO
title: Mulliken charges:
elementType: O N C C C C C C C C C C C C C C C C C C H H H H H H H H H H H H H H H H H H H H H H H
charge: -0.436962 -0.047295 0.190599 -0.259883 -0.096269 -0.269385 -0.462109 0.328494 -0.427573 0.303895 -0.803790 -0.551578 -0.798717 -0.366167 0.385268 -0.597331 -0.374022 0.274264 -0.826190 -0.409107 0.237482 0.214348 0.233387 0.213352 0.194034 0.222181 0.207565 0.223247 0.205349 0.233945 0.229424 0.210706 0.226757 0.239774 0.211785 0.211653 0.227095 0.228810 0.219533 0.223560 0.230552 0.249258 0.350064
chargesum: 0.00000
title: Mulliken charges with hydrogens summed into heavy atoms:
elementType: O N C C C C C C C C C C C C C C C C C C
charge: -0.086898 -0.047295 0.190599 -0.022401 0.118079 -0.035998 -0.054723 0.328494 0.002172 0.303895 -0.141250 -0.111448 -0.120401 -0.154513 0.385268 -0.370237 -0.145212 0.274264 -0.152546 -0.159849
polarizability: 2.35845087e+02 1.72076955e+00 1.95363117e+02 4.20381107e+00 -8.31929371e+00 1.51754255e+02
1716.lowfreq: -12.6938 0.0005 0.0006 0.0006 11.9767 17.5564 57.2341 62.4189 113.7062
frequency: 57.1483 62.3275 113.6833 133.8958 158.8302 173.1094 199.6240 207.5262 235.4937 243.5897 261.3450 273.1333 290.4097 297.8106 302.5331 328.3324 341.6670 344.1026 357.0178 387.4099 415.3545 423.7389 441.9814 463.3943 494.8461 499.1316 503.0256 525.5176 556.6754 597.7118 634.7393 680.2393 686.8001 714.6364 728.2487 740.5662 776.6621 812.8955 823.7413 836.3702 848.8265 853.5443 877.3673 903.4495 921.0949 936.9885 945.0909 952.5207 972.6274 1005.0324 1013.8105 1018.3161 1035.8910 1052.2507 1065.9878 1071.2446 1084.8219 1112.5493 1122.3768 1130.3533 1139.6683 1153.0231 1159.5468 1165.4704 1176.6654 1186.4851 1200.0840 1230.7526 1237.9751 1240.5895 1257.6827 1266.3869 1284.0364 1299.2889 1303.3052 1313.7564 1324.7664 1330.6513 1344.9269 1354.2387 1367.9632 1376.1140 1378.8788 1381.2437 1390.8543 1394.2890 1420.0182 1448.4288 1448.7801 1460.8223 1468.4752 1470.1767 1481.2074 1482.8041 1488.8220 1492.8215 1495.1609 1600.0790 1614.9111 1689.3876 2904.3884 2916.5797 2937.3551 2956.0049 2972.6289 2973.0561 2976.2445 2976.9763 2985.1218 3005.1577 3010.7668 3026.5833 3039.2739 3058.9697 3064.8416 3073.7651 3077.5753 3081.3295 3094.1807 3116.0419 3129.1927 3170.8754 3580.3342
redmass: 4.4167 3.3188 3.2965 2.9354 1.3190 2.2489 3.2258 1.1335 3.0821 3.2971 1.9382 1.9953 2.7292 1.6125 2.6640 2.8302 2.1778 1.3721 3.8455 3.7519 2.9810 2.5552 3.2427 3.2535 3.5298 3.7125 3.8004 3.5257 4.0898 4.1977 3.4772 3.6345 5.8619 3.9623 3.5257 2.9326 2.0309 2.5323 1.3799 2.1299 1.9299 1.9207 2.5952 2.5458 2.6441 2.0784 1.5412 1.4487 1.6429 1.6853 1.5040 1.5703 2.4226 1.9432 1.9202 2.2378 2.5870 2.2350 2.3349 1.9235 1.8622 1.5692 2.4060 1.8868 1.8975 1.7166 2.4233 1.4361 1.7037 1.4473 1.9399 1.7511 1.5795 1.4899 1.6108 1.5878 1.4667 1.4146 1.5261 1.5651 1.4660 2.8749 1.3511 1.6412 1.2122 1.2343 3.0160 1.1019 1.0945 1.0485 1.0555 1.0644 1.1188 1.0602 1.5808 1.1351 1.3215 6.6587 6.4724 6.8911 1.0688 1.0809 1.0645 1.0377 1.0427 1.0787 1.0570 1.0401 1.0823 1.0953 1.0893 1.0966 1.1028 1.0984 1.0985 1.0983 1.0994 1.0989 1.0905 1.0895 1.0884 1.0955 1.0659
irintensity: 0.1101 0.5054 0.3861 0.8179 0.5162 0.2074 0.8147 0.0043 0.2426 0.0872 1.2958 2.1368 0.2447 0.2520 0.9486 1.6740 24.0568 104.7816 3.9129 5.1014 1.0772 2.7136 12.4540 12.9923 10.1515 1.8393 0.5199 8.0886 5.5265 1.7375 3.4385 6.6063 2.2491 0.9753 4.9021 4.8530 1.5379 1.4581 27.8421 21.1104 5.8142 28.8875 11.1176 5.5268 20.7917 2.9119 2.6202 2.0098 3.5338 5.8020 2.5789 2.7669 5.1744 11.1614 1.7208 11.2882 4.6466 52.3114 14.2793 29.9334 157.2038 48.5857 10.1487 4.1946 4.4705 5.3802 9.0044 1.3946 12.8389 1.3047 8.6950 2.3304 5.5206 3.0227 1.5239 2.2205 3.6377 7.6214 1.4250 4.3977 4.1915 3.5625 14.8436 6.2948 20.2981 12.2505 53.9118 20.4496 3.4481 12.7305 9.2323 12.9869 14.2278 5.3515 23.8612 11.4349 31.4800 8.0501 69.9204 0.4252 53.5542 19.2225 54.9341 70.0476 10.1060 9.6811 72.6838 26.4742 56.7353 12.2454 77.2369 27.6602 30.6557 44.1791 27.4222 23.3968 54.7339 22.4583 26.8062 22.8432 16.0546 10.6064 32.8951
temp: 298.150 k
press: 1.00000 atm
elementType: 8 7 6 6 6 6 6 6 6 6 6 6 6 6 6 6 6 6 6 6 1 1 1 1 1 1 1 1 1 1 1 1 1 1 1 1 1 1 1 1 1 1 1
symmnumber: 1
zpe: 965967.7 jmol-1
zpe.correction: 0.367918 hartree
zpe.thermalcorrener: 0.385615 hartree
zpe.thermalcorrenthalpy: 0.386559 hartree
zpe.thermalcorrgfe: 0.324851 hartree
zpe.sumelectzpe: -828.182896 hartree
zpe.sumelectthermal: -828.165199 hartree
zpe.sumelectthermalent: -828.164254 hartree
zpe.sumelectthermalfe: -828.225963 hartree
dipole: 0.5231 1.1521 -0.4726
dipole: 1.3506
quadrupole: -114.7078 -121.7028 -118.2309
quadrupole: -11.3300 3.9664 -2.1042
quadrupole: 3.5061 -3.4890 -0.0171 -11.3300 3.9664 -2.1042
hfenergy: -828.5508138 hartree
pointgroup: C01 [X(C18H23N1O1)]
dipole: 0.2305874 0.4434109 -0.1805038 debye
polarizability: 235.9430318|-0.7040348|195.5435269|3.2990103|-7.8931029|151.4759009 unknown
InChI: InChI=1S/C18H23NO/c1-11-8-15-14-5-4-13(20)9-16(14)18(3)6-7-19(10-11)17(15)12(18)2/h4-5,8-9,12,15,17,20H,6-7,10H2,1-3H3
charge 0 multiplicity 1
43 atoms
O  -4.504024 -1.531456 -0.700948
N  2.153348 0.983562 -0.576298
C  -0.688196 1.734301 -0.253605
C  1.477837 0.925068 0.753169
C  0.388949 2.016647 0.843937
C  0.901411 -0.488782 1.091369
C  0.048052 1.767103 -1.638009
C  -1.295354 0.334124 -0.032272
C  1.223802 0.779965 -1.720486
C  -0.532698 -0.710641 0.570039
C  -1.756164 2.85773 -0.25461
C  3.308229 0.05808 -0.608345
C  -0.180703 2.142991 2.274201
C  1.875163 -1.579492 0.642099
C  2.985738 -1.353939 -0.110734
C  -2.618748 0.056093 -0.461019
C  -1.139041 -1.982241 0.746238
C  -3.191314 -1.222115 -0.289149
C  3.959572 -2.448164 -0.494036
C  -2.452798 -2.255262 0.325786
H  2.265291 1.146021 1.502305
H  0.882359 2.973307 0.574933
H  0.844053 -0.553389 2.201669
H  0.424918 2.796632 -1.799206
H  -0.675028 1.539947 -2.445561
H  0.836252 -0.26426 -1.774383
H  1.790927 0.964727 -2.6533
H  -1.257621 3.84491 -0.230904
H  -2.376798 2.832186 -1.169716
H  -2.430121 2.791846 0.617489
H  4.130741 0.485041 0.005696
H  3.69165 0.010774 -1.647274
H  -0.8190 3.03864 2.372703
H  -0.789454 1.265066 2.556596
H  0.641024 2.239817 3.009047
H  1.661078 -2.604606 0.975416
H  -3.216115 0.850323 -0.926361
H  -0.570071 -2.785603 1.228112
H  4.990725 -2.196876 -0.17344
H  3.995235 -2.584332 -1.593585
H  3.689778 -3.417175 -0.038504
H  -2.91275 -3.237715 0.464846
H  -4.935535 -0.74085 -1.110208
