program: Gaussian 09
title: 000017892
version: EM64L-G09RevD.01
frameworkgroup: C1[X(C8H3Cl5O3)]
method: RPBEPBE
basis: SDD
operation: Freq
keyword: #p
keyword: freq=noraman
keyword: PBEPBE/SDD
title: #p freq=noraman PBEPBE/SDD
converged: YES YES NO NO
title: Mulliken charges:
elementType: Cl Cl Cl Cl Cl O O O C C C C C C C C H H H
charge: 0.059810 0.059794 0.062902 0.062900 0.068608 -0.243206 -0.418891 -0.186071 0.666201 -0.310037 -0.310011 -0.079849 -0.079684 -0.118250 -0.335210 0.187115 0.261178 0.261149 0.391551
chargesum: 0.00000
title: Mulliken charges with hydrogens summed into heavy atoms:
elementType: Cl Cl Cl Cl Cl O O O C C C C C C C C
charge: 0.059810 0.059794 0.062902 0.062900 0.068608 -0.243206 -0.027339 -0.186071 0.666201 -0.310037 -0.310011 -0.079849 -0.079684 -0.118250 0.187118 0.187115
polarizability: 1.99254822e+02 5.87261976e-02 1.73564371e+02 -6.50748719e+00 6.37332781e-02 7.16009873e+01
1716.lowfreq: -7.0009 -2.3479 -0.0017 -0.0017 -0.0006 2.3779 18.7756 24.6747 38.4261
frequency: 18.6360 24.4306 38.4260 58.7761 76.2397 78.4684 116.2297 159.3803 184.0255 199.4795 200.7437 213.6412 220.8667 273.5749 311.1349 316.1330 317.9965 334.6714 357.5223 417.9664 480.0984 495.4263 585.6609 589.7097 608.9790 621.7897 639.3765 656.5541 720.5706 779.2232 819.9277 872.3825 893.7290 991.0041 992.6785 1048.8673 1079.2802 1197.5836 1234.1301 1257.5986 1315.4656 1337.3095 1340.1583 1389.9896 1444.4282 1520.7317 1541.7734 1705.8752 2989.0105 3050.3096 3528.0413
redmass: 11.7027 9.9616 15.0646 4.8433 4.3801 27.0719 12.3151 12.5773 12.7987 32.6211 30.7188 34.6303 17.5681 13.4530 23.2448 12.5264 15.3928 17.4765 27.7087 8.5655 8.6294 1.8139 6.2180 12.0578 12.5480 1.4598 10.4027 13.9040 13.2102 10.8624 12.8937 4.4589 10.2370 1.9905 7.3417 2.7737 9.3958 1.0753 10.4689 1.6749 12.0078 12.0204 4.5689 2.1335 1.0873 11.9853 10.6295 9.4694 1.0558 1.1053 1.0644
irintensity: 0.0000 2.2284 0.5600 2.1366 2.8356 0.1801 1.3260 0.2138 0.5380 0.0169 0.1536 0.0064 0.0419 2.4350 0.4618 0.0836 0.5293 0.3851 0.5025 4.7155 41.4356 30.3837 11.7079 0.0068 12.4792 115.9082 0.5771 86.6848 58.6292 5.3657 0.0983 7.0459 23.7221 14.6194 297.5556 170.3262 1.7979 1.5219 1.6866 48.8925 82.7220 70.8595 168.8244 151.2807 18.6254 2.3630 2.7190 225.1580 30.6739 5.2306 40.1321
temp: 298.150 k
press: 1.00000 atm
elementType: 17 17 17 17 17 8 8 8 6 6 6 6 6 6 6 6 1 1 1
symmnumber: 1
zpe: 249098.4 jmol-1
zpe.correction: 0.094877 hartree
zpe.thermalcorrener: 0.111510 hartree
zpe.thermalcorrenthalpy: 0.112454 hartree
zpe.thermalcorrgfe: 0.046393 hartree
zpe.sumelectzpe: -2831.412542 hartree
zpe.sumelectthermal: -2831.395909 hartree
zpe.sumelectthermalent: -2831.394965 hartree
zpe.sumelectthermalfe: -2831.461026 hartree
dipole: 1.2090 0.0044 2.8859
dipole: 3.1289
quadrupole: -115.3275 -125.3644 -129.5707
quadrupole: 0.0498 11.5739 -0.0621
quadrupole: 8.0933 -1.9435 -6.1498 0.0498 11.5739 -0.0621
hfenergy: -2831.507419 hartree
pointgroup: C01 [X(C8H3Cl5O3)]
dipole: 0.4839204 -0.0035025 -1.1318942 debye
dipolederiv: -0.2176515 0.2841729 -0.0281666 0.2791071 -0.476907 0.0510233 -0.0079135 0.0302911 0.0075725 -0.2156409 -0.2830816 -0.0265272 -0.2778985 -0.4796447 -0.0488456 -0.0062113 -0.0280909 0.0079094 -0.1795407 0.2818309 -0.0143007 0.30243 -0.4986827 0.0254408 -0.0253741 0.0374241 0.0155118 -0.1771048 -0.2805 -0.0129122 -0.3012371 -0.5013195 -0.0231239 -0.0238679 -0.0351716 0.015781 -0.6704946 -0.0014836 -0.0662546 -0.0015601 -0.0014863 -0.0000953 -0.0804954 -0.0001262 0.0121077 -1.4850314 -0.0022685 0.1864849 -0.0030414 -0.3211024 0.000136 0.1939437 0.0007973 -0.2668414 -0.9197944 0.0068613 0.5453775 0.0085472 -0.4157583 -0.006311 0.5509971 -0.0056924 -0.8477009 -0.714581 -0.0016374 -0.2319271 0.0020701 -0.2647712 -0.0062916 0.0340314 -0.0064862 -0.90601 1.1524755 0.002441 -0.0452785 0.003223 -0.0771831 0.0005364 0.192206 0.0009284 0.0656079 0.1122217 -0.446761 0.0620491 -0.6266903 0.5557048 -0.0866106 0.0342854 -0.048264 -0.0605013 0.1080129 0.4452057 0.0595012 0.6252197 0.5606372 0.0838241 0.0311486 0.0454284 -0.0610835 0.0320984 -0.4781123 0.0056678 -0.5672197 0.6555317 -0.0596787 0.0115859 -0.0576411 -0.0088843 0.0277917 0.4756142 0.0032359 0.5646088 0.660281 0.0566993 0.0088531 0.0547234 -0.0093914 0.910598 0.0026483 0.1019759 0.0027837 -0.2975345 0.0008141 0.1102453 0.0008161 -0.026144 0.4036236 0.0022121 -0.2763347 0.0039439 0.3288815 -0.0007603 -0.8105655 -0.0017055 0.2724062 1.5764907 -0.0059887 -0.1575914 -0.0105901 0.191809 0.0147904 -0.2419038 0.0141826 1.4998103 0.0251054 -0.0241977 -0.0004436 0.0232059 -0.0036791 -0.0963535 0.0897594 -0.044837 0.0191448 0.0247342 0.0237973 -0.0006903 -0.0257716 -0.0040784 0.0964106 0.0897625 0.0447224 0.0194932 0.2066872 -0.0007528 -0.1038655 -0.0011305 0.3893019 -0.0016044 -0.1504869 -0.0012988 0.2512121 unknown
polarizability: 199.1534434|-0.033525|173.5642372|7.4354313|-0.1135686|71.7025001 unknown
InChI: InChI=1S/C8H3Cl5O3/c9-3-4(10)6(12)8(7(13)5(3)11)16-1-2(14)15/h14H,1H2
charge 0 multiplicity 1
19 atoms
Cl 0.376104 -2.754981 0.286774
Cl 0.364593 2.760269 0.274291
Cl -2.852738 2.780348 -0.121058
Cl -2.841058 -2.790331 -0.108463
Cl -4.446258 -0.008728 -0.305211
O  1.524509 0.005584 0.54379
O  4.684055 -0.012298 -1.263459
O  4.251813 0.014836 1.030083
C  0.156133 0.002166 0.259823
C  -0.554856 -1.220106 0.165321
C  -0.56001 1.220968 0.159751
C  -1.961667 1.223393 -0.011053
C  -1.956502 -1.229167 -0.005498
C  -2.661984 -0.004562 -0.09346
C  2.403978 0.005396 -0.635923
C  3.84203 0.003421 -0.140449
H  2.232045 -0.894274 -1.257433
H  2.23447 0.907593 -1.25475
H  5.634642 -0.010927 -0.969074
