program: Gaussian 09
title: 000190954
version: EM64L-G09RevD.01
frameworkgroup: C1[X(C22H28O4)]
method: RPBEPBE
basis: SDD
operation: Freq
keyword: #pfreq=noraman
keyword: PBEPBE/SDD
title: #p freq=noraman PBEPBE/SDD
converged: YES YES NO NO
title: Mulliken charges:
elementType: O O O O C C C C C C C C C C C C C C C C C C C C C C H H H H H H H H H H H H H H H H H H H H H H H H H H H H
charge: -0.280561 -0.404493 -0.232631 -0.179025 0.330626 -0.061769 0.194799 0.318649 -0.480858 -0.082673 -0.524257 -0.450718 -0.446545 -0.457410 -0.831631 -0.439532 -0.773354 -0.768826 -0.751324 0.408660 0.023621 -0.559337 0.199890 0.165902 -0.070047 -0.205156 0.215576 0.215930 0.227140 0.229859 0.203850 0.219675 0.221481 0.205601 0.200468 0.200697 0.210211 0.201648 0.227920 0.230804 0.230821 0.286175 0.218453 0.217616 0.213854 0.215604 0.215257 0.224766 0.228697 0.238430 0.222074 0.273069 0.181545 0.380779
chargesum: 0.00000
title: Mulliken charges with hydrogens summed into heavy atoms:
elementType: O O O O C C C C C C C C C C C C C C C C C C C C C C
charge: -0.280561 -0.023713 -0.232631 -0.179025 0.330626 0.153807 0.194799 0.318649 -0.037788 0.147186 -0.100732 -0.023636 -0.045381 -0.045552 -0.142086 -0.153357 -0.123430 -0.113199 -0.062124 0.408660 0.023621 -0.286268 0.199890 0.165902 -0.070047 -0.023611
polarizability: 3.52894328e+02 3.90629060e+01 2.30982649e+02 5.69969822e+00 -2.08659842e+01 2.08218741e+02
1716.lowfreq: -4.4150 -0.0003 0.0005 0.0006 6.3306 23.3364 36.5207 46.3794 54.2238
frequency: 36.1381 45.0232 53.9116 81.7816 89.8089 108.6882 132.9244 141.4500 146.4328 166.3295 183.8218 190.7337 204.5720 218.4117 234.0212 238.3406 241.8518 245.6030 268.1356 278.7186 301.3515 309.1724 319.4255 328.4074 334.5208 340.2555 341.1273 365.6829 387.9664 406.8408 420.9716 428.4473 435.9494 440.1220 462.0417 481.6852 490.3212 505.2747 517.9709 538.7474 541.0229 594.5496 597.7588 667.4762 693.4716 706.7360 720.1591 742.4559 747.9509 753.4359 767.1542 788.2019 807.4452 828.2605 836.4222 856.1427 867.7186 878.6097 890.6890 913.4668 926.2586 927.6088 943.7873 960.2190 967.1356 972.0382 974.2372 977.9128 984.0465 997.7604 1008.9939 1034.2505 1045.1638 1058.3129 1082.4806 1093.3515 1097.0543 1103.3793 1111.0311 1131.9414 1157.3315 1159.9205 1175.0255 1185.3509 1190.0792 1197.3035 1209.0704 1209.3609 1228.4489 1238.4231 1263.7880 1268.3980 1288.8592 1300.5224 1314.2569 1321.8672 1325.1580 1333.6864 1338.0526 1343.6658 1348.5385 1353.5566 1358.4747 1365.8771 1378.4060 1389.5998 1392.1994 1394.8913 1401.5389 1408.5697 1453.6213 1461.5146 1463.6367 1466.3853 1468.3974 1473.7658 1474.4963 1478.6141 1481.1588 1484.8131 1486.0874 1493.1988 1499.7928 1520.7535 1572.0311 1602.3595 1620.1670 1655.7553 2877.8653 2956.2324 2959.8576 2968.4398 2976.5653 2978.5204 2980.6525 2982.0498 2984.2096 2985.1691 2986.2847 3001.9153 3019.1752 3029.7054 3037.8790 3044.5317 3049.4240 3060.7510 3067.1492 3068.5956 3078.9514 3084.3317 3085.8783 3091.4446 3108.0720 3174.6553 3196.9689 3213.6626
redmass: 5.6832 7.7235 3.5866 7.7857 2.6903 2.9225 3.5035 2.2694 1.3868 4.6749 3.8818 2.5874 4.4788 1.5387 1.1560 1.1940 1.9481 3.0119 2.1941 2.4205 2.7723 2.8421 2.7198 2.5985 4.4629 3.0673 4.5147 3.2568 2.7898 4.0800 3.8747 4.2994 4.1880 4.2352 2.6929 4.2955 3.5448 3.1803 3.9883 2.3631 2.2757 4.5850 3.3908 2.7301 4.8402 4.3646 3.5014 1.2563 7.5073 6.9491 2.3798 4.2825 1.7570 1.9508 1.7424 1.6039 1.7555 2.3313 2.8261 1.8238 1.5362 1.6010 1.9616 1.8380 2.3520 1.8923 5.2209 1.6884 1.6964 4.8081 1.5651 1.7427 1.7443 2.2410 1.5980 2.3724 2.2431 1.7987 2.3544 1.8732 3.6534 2.5606 2.0525 2.5746 1.7812 2.0393 1.8909 1.5881 1.7114 2.0249 3.6284 1.9411 1.3929 1.4415 1.5891 2.8532 1.5631 1.3788 1.4714 1.4205 1.3489 1.4876 1.8602 1.3853 1.1977 2.4477 1.2477 1.3844 1.2082 1.4021 1.0795 1.0727 1.0497 1.0760 1.0770 1.0836 1.0514 1.0660 1.0579 1.0534 1.0617 1.0600 1.0523 8.7218 10.8199 7.2556 6.4575 7.3084 1.0836 1.0717 1.0679 1.0367 1.0601 1.0637 1.0748 1.0587 1.0447 1.0622 1.0417 1.0388 1.0979 1.0996 1.0972 1.1019 1.1009 1.0988 1.0972 1.0991 1.0992 1.0971 1.0998 1.0968 1.0970 1.0935 1.0953 1.0621
irintensity: 1.2842 0.5521 0.5417 0.0526 0.0208 0.4514 2.3111 5.0904 2.9231 0.2500 1.2335 0.9013 2.2252 0.3770 0.0506 0.3823 0.1618 4.8191 0.7170 0.0196 0.2861 0.5858 2.6584 1.4295 26.5288 0.7754 13.4273 1.7496 1.0102 8.1517 1.8670 1.5061 0.5600 1.0449 0.3723 1.2108 0.3304 4.2194 7.9322 4.7571 0.3240 12.8367 8.8952 4.4623 7.6001 30.1445 2.5325 84.8808 26.5913 6.2872 0.6249 31.2759 4.4630 1.6355 2.3545 9.8230 28.4917 1.2736 23.3436 1.6150 1.7915 3.1931 16.7660 1.9621 3.5980 2.1714 63.2469 15.2874 6.5809 10.1246 0.2888 10.4606 4.7255 2.2506 2.3893 5.3155 3.4636 6.7750 37.6154 1.1598 14.4832 4.2681 70.7218 37.3289 19.2611 1.6744 21.3477 134.1318 29.8943 7.7868 120.8727 21.0007 10.8950 6.4579 77.1507 87.1865 16.8875 3.9810 3.7930 11.4100 11.5957 3.5314 252.5414 12.2230 14.4960 79.9803 16.7171 15.7348 25.5916 67.7837 4.7412 2.2215 0.4770 8.5014 4.7878 6.7978 19.4867 12.2190 19.4934 9.4204 4.3916 9.1239 9.9297 40.4558 251.2608 49.5404 377.6044 54.4463 51.9484 6.5497 19.4541 37.2761 21.6014 16.0083 21.6225 48.7048 39.7665 15.5369 36.7835 34.8975 52.6935 31.8585 30.1301 25.1903 45.0724 21.9996 72.3075 33.4525 35.2108 55.7745 21.4939 14.6454 28.0641 4.5192 3.2481 96.1254
temp: 298.150 k
press: 1.00000 atm
elementType: 8 8 8 8 6 6 6 6 6 6 6 6 6 6 6 6 6 6 6 6 6 6 6 6 6 6 1 1 1 1 1 1 1 1 1 1 1 1 1 1 1 1 1 1 1 1 1 1 1 1 1 1 1 1
symmnumber: 1
zpe: 1184929.7 jmol-1
zpe.correction: 0.451316 hartree
zpe.thermalcorrener: 0.475944 hartree
zpe.thermalcorrenthalpy: 0.476888 hartree
zpe.thermalcorrgfe: 0.399863 hartree
zpe.sumelectzpe: -1154.057922 hartree
zpe.sumelectthermal: -1154.033294 hartree
zpe.sumelectthermalent: -1154.032350 hartree
zpe.sumelectthermalfe: -1154.109375 hartree
dipole: 7.8962 5.5452 -2.6034
dipole: 9.9939
quadrupole: -180.8702 -160.1665 -159.4715
quadrupole: -14.5462 7.8515 8.5856
quadrupole: -14.0341 6.6696 7.3646 -14.5462 7.8515 8.5856
hfenergy: -1154.5092381 hartree
pointgroup: C01 [X(C22H28O4)]
dipole: -3.0744463 -2.1997315 -1.0811071 debye
polarizability: 351.8852486|40.6900891|231.1281681|-4.6504008|21.407028|209.0823007 unknown
InChI: InChI=1S/C22H28O4/c1-13-6-7-17-20(2,3)8-5-9-21(17,4)22(13)11-14-10-16(24)18(25)15(12-23)19(14)26-22/h10-13,17,24H,5-9H2,1-4H3
charge 0 multiplicity 1
54 atoms
O  0.247698 -0.104783 0.756981
O  5.259394 -0.167759 -1.598738
O  4.825098 1.54645 0.313641
O  2.926749 2.681913 2.326659
C  -1.75506 -0.51447 -0.726059
C  -2.627155 0.157294 0.408143
C  -0.501114 -1.202561 -0.012397
C  -3.770107 1.132611 -0.079935
C  -1.24827 0.577189 -1.716724
C  -0.933939 -2.263231 1.056975
C  -3.096375 -0.895806 1.44338
C  -1.899313 -1.627717 2.088677
C  -3.163489 2.13761 -1.107135
C  -2.389646 1.465375 -2.258729
C  -2.497725 -1.62158 -1.531651
C  0.55926 -1.693312 -0.966655
C  -4.265793 1.966128 1.139037
C  -5.011848 0.41976 -0.684721
C  0.267444 -2.933154 1.758608
C  1.741501 -0.99932 -0.811982
C  1.531333 -0.017727 0.261362
C  3.022579 -1.076319 -1.471611
C  2.49701 0.882005 0.723472
C  3.999129 -0.202618 -1.051073
C  3.803238 0.816291 0.055887
C  2.162906 1.818684 1.818587
H  -1.915531 0.823529 0.942501
H  -0.711029 0.099314 -2.559204
H  -0.519806 1.23079 -1.198961
H  -1.482786 -3.045993 0.494043
H  -3.777194 -1.633811 0.975312
H  -3.678748 -0.401311 2.241642
H  -1.324607 -0.915021 2.711933
H  -2.261119 -2.427132 2.764351
H  -2.470023 2.815352 -0.565993
H  -3.976926 2.772761 -1.511146
H  -1.958787 2.242049 -2.919507
H  -3.078993 0.873946 -2.892459
H  -3.092442 -2.296947 -0.895414
H  -3.186359 -1.168277 -2.260999
H  -1.786331 -2.238483 -2.109702
H  0.388671 -2.506256 -1.673341
H  -3.419036 2.418869 1.689248
H  -4.920062 2.787992 0.791405
H  -4.853628 1.359642 1.851538
H  -5.82111 1.158179 -0.840862
H  -4.810074 -0.054821 -1.659305
H  -5.403857 -0.35759 -0.003822
H  0.920994 -3.471129 1.049327
H  0.882105 -2.188182 2.294593
H  -0.096272 -3.664045 2.503481
H  3.211439 -1.792406 -2.274777
H  1.115058 1.699987 2.19166
H  5.750345 0.562036 -1.095946
