program: Gaussian 09
title: 000182518
version: EM64L-G09RevD.01
frameworkgroup: C1[X(C19H17N)]
method: RPBEPBE
basis: SDD
operation: Freq
keyword: #pfreq=noraman
keyword: PBEPBE/SDD
title: #p freq=noraman PBEPBE/SDD
converged: YES YES NO NO
title: Mulliken charges:
elementType: N C C C C C C C C C C C C C C C C C C C H H H H H H H H H H H H H H H H H
charge: -0.011198 -0.654578 0.320449 0.138958 0.247010 -0.437432 0.503709 0.288769 -0.563064 -0.822410 -0.382101 -0.445412 -0.378674 -0.412503 -0.225357 -0.224194 -0.236993 -0.228262 -0.249075 -0.242609 0.216519 0.249767 0.244091 0.262669 0.232741 0.249967 0.234066 0.247229 0.230822 0.235281 0.249508 0.224312 0.224107 0.227919 0.228012 0.227015 0.230942
chargesum: 0.00000
title: Mulliken charges with hydrogens summed into heavy atoms:
elementType: N C C C C C C C C C C C C C C C C C C C
charge: -0.011198 -0.188292 0.320449 0.138958 0.247010 -0.193341 0.503709 0.288769 -0.300395 -0.105636 -0.134872 -0.214590 -0.143393 -0.162995 -0.001045 -0.000087 -0.009074 -0.000250 -0.022060 -0.011667
polarizability: 3.09905754e+02 -1.01397428e+01 1.78361449e+02 2.31393269e+01 4.09756558e+00 1.46347058e+02
1716.lowfreq: -4.6841 -4.1228 0.0001 0.0004 0.0008 2.6148 8.6838 22.1673 30.3793
frequency: 6.1171 22.0524 30.3738 61.5132 73.1102 94.4480 156.8565 178.7876 186.7807 197.0418 227.0687 278.5046 314.0721 328.6457 392.5275 404.2983 407.6209 416.3380 457.9281 474.4548 507.8229 555.7034 559.6799 586.0778 615.0355 618.2750 644.0627 702.4820 706.4780 709.4205 733.7302 751.2650 772.6808 781.6602 819.0349 854.8968 855.5615 891.4838 914.0897 920.3479 927.7313 933.3618 950.0247 977.5336 978.0517 984.0036 990.2698 991.5663 995.3908 996.0839 1009.1965 1026.3618 1034.4052 1043.6289 1079.5339 1081.3132 1155.9184 1158.6948 1171.5130 1173.1329 1187.6537 1191.2056 1205.9090 1219.1130 1275.0607 1292.6600 1305.9507 1312.8182 1321.9175 1334.0231 1359.1460 1375.5104 1382.6353 1399.5372 1432.9623 1440.6881 1458.4141 1459.1858 1465.9825 1471.1690 1483.3839 1491.1674 1539.9897 1578.9871 1588.5934 1592.9380 1611.7419 1613.9645 2981.2782 2991.0320 3052.6617 3062.5496 3096.1265 3113.8826 3119.8606 3120.1840 3124.1398 3129.5748 3130.8664 3132.8137 3142.4396 3143.2870 3151.1188 3161.3900 3165.9304
redmass: 4.2639 3.7995 5.1863 3.8825 4.8322 4.5528 1.0383 3.9209 4.4890 3.9980 4.8119 3.7015 2.2934 5.1541 3.5738 2.8168 2.8949 3.3287 2.9080 3.3488 4.1914 4.3390 5.2069 5.1087 6.2923 6.3203 4.4821 3.3386 1.7211 2.0469 4.1975 2.1810 2.0195 3.4802 3.4206 1.2442 1.2471 1.5631 1.5781 1.4196 2.4139 1.4695 1.9515 1.4088 1.3885 6.0330 6.2061 6.2065 1.3218 1.3179 1.5793 2.2151 1.9700 1.5768 1.6143 1.6049 1.7572 1.4394 1.0578 1.0527 1.1240 1.1138 2.9281 2.4082 1.8050 2.0033 3.6769 1.6234 1.6405 1.3589 3.5993 7.7997 7.5919 1.2342 2.3142 2.1303 2.0904 1.1373 1.1251 1.1098 2.2037 2.7852 5.0178 5.9515 6.3574 6.0696 6.1281 6.1056 1.0391 1.0610 1.0994 1.0944 1.0999 1.0866 1.0906 1.0865 1.0848 1.0880 1.0918 1.0915 1.0922 1.0961 1.0963 1.1015 1.1016
irintensity: 0.3450 0.0302 0.3966 0.5638 0.9448 0.1031 0.3545 0.4935 0.5670 1.0023 0.3253 0.7005 1.5231 0.8425 0.3915 0.2225 0.1449 5.1066 9.9110 8.1228 7.8558 3.8833 3.5276 1.5425 0.5209 0.3940 4.8778 1.9325 62.9531 64.5591 21.9529 18.2334 55.2797 1.1818 1.5302 0.3175 0.1487 15.0690 1.3914 0.6794 6.3403 2.0621 5.3220 0.4025 0.2297 6.3888 0.1087 6.5463 0.2225 0.0261 4.4976 8.4367 3.3361 7.0643 12.5223 7.0645 0.7224 5.2997 0.1817 0.0080 1.4872 0.6150 0.0736 4.5300 0.7366 5.3042 2.1775 2.1771 3.2595 1.4920 10.0033 2.0796 0.4040 18.8462 9.1961 4.8705 50.8413 17.5078 21.7782 45.3851 20.8345 0.0531 10.8536 31.9122 45.6114 1.3799 5.1630 9.4935 16.8411 22.5946 6.1911 18.0492 14.2169 8.6133 32.0857 0.2386 1.1845 1.4850 6.7513 14.0104 17.1036 43.1735 37.9092 27.4281 23.4893
temp: 298.150 k
press: 1.00000 atm
elementType: 7 6 6 6 6 6 6 6 6 6 6 6 6 6 6 6 6 6 6 6 1 1 1 1 1 1 1 1 1 1 1 1 1 1 1 1 1
symmnumber: 1
zpe: 789998.8 jmol-1
zpe.correction: 0.300895 hartree
zpe.thermalcorrener: 0.317774 hartree
zpe.thermalcorrenthalpy: 0.318718 hartree
zpe.thermalcorrgfe: 0.252612 hartree
zpe.sumelectzpe: -787.598721 hartree
zpe.sumelectthermal: -787.581842 hartree
zpe.sumelectthermalent: -787.580898 hartree
zpe.sumelectthermalfe: -787.647004 hartree
dipole: -1.1473 -2.2081 1.3130
dipole: 2.8135
quadrupole: -103.7659 -115.1696 -114.8707
quadrupole: -3.3840 4.5291 3.3186
quadrupole: 7.5029 -3.9009 -3.6020 -3.3840 4.5291 3.3186
hfenergy: -787.899616 hartree
pointgroup: C01 [X(C19H17N1)]
dipole: -0.4887982 -0.0276667 0.9927741 debye
polarizability: 307.0146631|19.793515|159.8052609|26.5972299|-14.7114569|167.794337 unknown
InChI: InChI=1S/C19H17N/c1-15-12-18(13-16-8-4-2-5-9-16)20-14-19(15)17-10-6-3-7-11-17/h2-12,14H,13H2,1H3
charge 0 multiplicity 1
37 atoms
N  0.245135 0.70058 -1.790629
C  2.47083 1.417605 -1.006327
C  -0.828338 0.639657 0.865807
C  1.029272 1.01912 -0.713001
C  -1.651799 0.303823 -0.256963
C  0.518042 0.989796 0.606295
C  3.510948 0.527333 -0.327953
C  -3.089977 -0.083683 -0.156315
C  -1.049143 0.356122 -1.544424
C  -1.34263 0.668535 2.293841
C  3.503715 -0.876048 -0.544079
C  4.509203 1.078321 0.513561
C  -3.538709 -1.07687 0.757352
C  -4.047408 0.510607 -1.025015
C  4.471393 -1.70477 0.063367
C  5.480606 0.25114 1.124827
C  -4.896834 -1.459064 0.804303
C  -5.406292 0.130186 -0.978536
C  5.464893 -1.144096 0.901629
C  -5.838213 -0.856256 -0.062145
H  2.633788 2.467764 -0.6952
H  2.58926 1.38105 -2.104667
H  1.181364 1.250185 1.439075
H  -1.641737 0.084019 -2.426415
H  -0.773289 1.397724 2.895822
H  -2.412455 0.932654 2.339431
H  -1.228655 -0.317448 2.783862
H  2.735547 -1.313588 -1.193177
H  4.529594 2.161684 0.68766
H  -2.815701 -1.573583 1.413533
H  -3.723961 1.289418 -1.725297
H  4.454324 -2.785876 -0.116757
H  6.246555 0.694873 1.771306
H  -5.218228 -2.23264 1.510789
H  -6.127034 0.606485 -1.65264
H  6.216838 -1.786998 1.372984
H  -6.892402 -1.15236 -0.024702
