program: Gaussian 09
title: 000190901
version: EM64L-G09RevD.01
frameworkgroup: C1[X(C21H26N2O)]
method: RPBEPBE
basis: SDD
operation: Freq
keyword: #p
keyword: freq=noraman
keyword: PBEPBE/SDD
title: #p freq=noraman PBEPBE/SDD
converged: YES YES NO NO
title: Mulliken charges:
elementType: O N N C C C C C C C C C C C C C C C C C C C C C H H H H H H H H H H H H H H H H H H H H H H H H H H
charge: -0.312817 -0.085952 -0.108509 -0.431359 -0.424050 -0.385816 -0.451954 -0.458079 -0.219089 0.423668 0.265575 -0.677520 -0.360893 -0.423688 -0.680554 -0.241884 -0.242034 0.494851 -0.244577 -0.444695 -0.395032 -0.226504 -0.220781 -0.247815 0.218722 0.215636 0.268527 0.210021 0.207558 0.202332 0.227423 0.219221 0.223976 0.219430 0.284398 0.246382 0.259059 0.249176 0.254870 0.244713 0.230263 0.260047 0.226255 0.223026 0.228167 0.234080 0.265762 0.225257 0.226830 0.228374
chargesum: 0.00000
title: Mulliken charges with hydrogens summed into heavy atoms:
elementType: O N N C C C C C C C C C C C C C C C C C C C C C
charge: -0.312817 -0.085952 -0.108509 0.003000 0.054498 0.024073 -0.005310 -0.014672 0.065309 0.423668 0.265575 0.077097 -0.106022 -0.178975 -0.190244 -0.015629 -0.019007 0.494851 -0.016410 -0.210615 -0.129269 -0.001247 0.006049 -0.019441
polarizability: 2.73703764e+02 -1.73541222e+01 2.37160235e+02 6.24727913e+00 -2.33897351e+00 1.86535608e+02
1716.lowfreq: -12.8385 -10.2931 -6.8595 -0.0004 -0.0003 0.0007 13.4855 17.4374 21.0486
frequency: 11.8963 16.6791 21.0040 27.8507 40.7327 50.8105 62.8378 66.7176 82.8415 108.1327 123.4839 141.8982 164.2712 199.3880 201.4563 225.5080 242.6896 285.6959 298.2046 308.2390 372.6861 373.3489 401.4263 405.6936 410.6049 455.1913 460.7147 499.4776 522.4553 558.7280 593.1693 612.0916 616.3099 620.3036 626.9095 649.4927 697.4040 702.3453 708.5522 718.1694 749.6378 755.5661 777.3179 821.1132 825.6892 836.6355 853.5835 857.7892 859.7230 876.8284 905.9216 912.9015 916.8604 926.2292 934.7214 957.5037 977.2599 981.8141 989.6704 989.8354 994.6896 998.9592 1010.3302 1019.4458 1026.8960 1029.5753 1042.3485 1062.1490 1070.3128 1078.8911 1085.0878 1101.7700 1110.2970 1126.7882 1167.5518 1171.4099 1172.6355 1173.0723 1189.1496 1195.0411 1196.0102 1200.2309 1202.7150 1213.4698 1217.2602 1246.3920 1271.2379 1279.5512 1280.7354 1296.3354 1300.3854 1316.5822 1321.1733 1324.3872 1332.1647 1335.7213 1365.4460 1380.3821 1381.9684 1395.2026 1434.6491 1436.1970 1440.8961 1459.6174 1464.1709 1470.3744 1474.8904 1479.4148 1480.7237 1485.4627 1489.4850 1492.4582 1493.7437 1566.3609 1590.5098 1592.7433 1612.0510 1613.9423 2866.5803 2971.5232 2986.3503 2990.8710 2996.0081 3002.2064 3011.9135 3015.1013 3017.9283 3052.6478 3064.6014 3067.7041 3069.0482 3082.8438 3096.8681 3103.9914 3110.9705 3120.3540 3122.0277 3129.7387 3132.5671 3142.5276 3143.1129 3150.9728 3161.4803 3164.2860
redmass: 4.1132 4.1507 4.3321 3.6303 4.0967 4.5021 3.2328 2.3855 3.3959 3.9671 3.7765 4.0609 1.2394 3.1544 2.8308 4.7362 3.9991 3.1809 2.8987 4.7134 2.6072 2.8803 2.7810 2.8488 2.1476 3.0523 3.2384 3.8392 4.4940 3.6652 4.1756 4.7839 6.3638 3.7822 3.0532 2.6880 4.6799 2.6434 1.9006 1.6535 1.9228 1.9390 2.2249 3.8654 1.6533 2.6501 1.2507 3.1279 1.2573 3.5004 2.4585 1.9597 1.4582 1.7881 1.7952 1.8255 1.3937 1.3776 6.0121 5.9195 1.3374 1.3308 2.2897 2.8388 2.2386 2.2120 2.5318 2.1074 2.1106 1.6036 1.8641 1.6701 1.3476 2.2412 1.3634 1.1934 1.0570 1.1645 1.1288 1.2326 1.2827 2.1349 2.5107 2.2375 1.2482 1.4153 1.4001 1.3472 1.4325 1.4244 1.2234 1.3369 1.3712 1.5721 1.3198 1.3875 1.3507 7.2355 6.5661 2.0152 1.3830 2.1995 2.1008 1.1212 1.0837 1.0901 1.1282 1.1030 1.9187 1.9306 1.0923 1.1623 1.0973 7.3874 5.9815 5.9809 6.0281 5.9408 1.0694 1.0391 1.0640 1.0810 1.0703 1.0595 1.0595 1.0875 1.0640 1.1010 1.0964 1.1017 1.1025 1.1033 1.1006 1.0991 1.0875 1.0865 1.0843 1.0876 1.0912 1.0923 1.0960 1.0956 1.1014 1.1013
irintensity: 0.3120 0.1788 0.1224 0.2934 0.3750 0.7481 2.2073 1.0124 1.7940 7.7370 1.4715 0.4655 0.2022 0.8866 0.0631 7.9162 1.4987 3.2113 0.5402 1.3344 2.4238 3.6420 0.1239 0.1054 5.1402 1.1665 1.9708 27.0809 12.5954 13.1821 25.8246 2.4933 0.7475 1.6900 5.6842 10.4345 6.4373 17.7067 49.0984 65.8492 15.2018 41.1384 24.3344 3.6064 2.0684 2.5957 0.1357 18.1591 1.2625 13.6655 2.3150 6.4700 5.2420 13.1066 6.2044 4.8984 0.0373 0.2047 0.1258 0.6036 0.9918 0.5784 7.5321 16.0178 10.7609 5.1827 38.5473 9.4061 20.0361 15.8323 2.6257 76.4322 3.1480 20.7882 6.3567 3.2689 0.1051 2.5369 1.8724 2.5059 4.3969 1.4774 1.7028 7.4120 5.4019 10.2412 11.5349 4.7563 6.4656 9.3037 1.7280 38.6151 24.5299 22.1483 2.4603 30.2879 2.8307 0.8533 0.1446 46.5585 7.9659 9.2587 10.6072 27.4101 0.4756 11.7841 6.2317 25.2541 20.2293 18.2091 13.3669 4.7506 2.8539 232.3546 3.3825 4.5605 10.9464 8.4233 77.5586 33.3952 44.1432 56.4630 18.9410 36.1015 16.5067 18.6107 61.1075 15.0467 12.6613 5.3494 8.1533 67.4414 36.8084 9.5209 10.4460 0.3532 1.4331 2.0746 9.4439 21.5722 32.9796 39.1522 26.7787 19.8715
temp: 298.150 k
press: 1.00000 atm
elementType: 8 7 7 6 6 6 6 6 6 6 6 6 6 6 6 6 6 6 6 6 6 6 6 6 1 1 1 1 1 1 1 1 1 1 1 1 1 1 1 1 1 1 1 1 1 1 1 1 1 1
symmnumber: 1
zpe: 1112094.5 jmol-1
zpe.correction: 0.423574 hartree
zpe.thermalcorrener: 0.446268 hartree
zpe.thermalcorrenthalpy: 0.447212 hartree
zpe.thermalcorrgfe: 0.366812 hartree
zpe.sumelectzpe: -998.777529 hartree
zpe.sumelectthermal: -998.754835 hartree
zpe.sumelectthermalent: -998.753891 hartree
zpe.sumelectthermalfe: -998.834292 hartree
dipole: 1.0337 0.8533 3.1843
dipole: 3.4550
quadrupole: -127.7586 -138.3824 -145.7520
quadrupole: -3.7764 0.9363 -4.8755
quadrupole: 9.5391 -1.0847 -8.4544 -3.7764 0.9363 -4.8755
hfenergy: -999.2011031 hartree
pointgroup: C01 [X(C21H26N2O1)]
dipole: -0.7119438 -0.2316698 1.1345154 debye
polarizability: 239.2330767|-20.8998138|265.7558952|0.4657206|21.1073301|192.4106359 unknown
InChI: InChI=1S/C21H26N2O/c1-22(21(24)16-18-10-4-2-5-11-18)20(17-23-14-8-9-15-23)19-12-6-3-7-13-19/h2-7,10-13,20H,8-9,14-17H2,1H3
charge 0 multiplicity 1
50 atoms
O  1.312713 1.296408 -1.482355
N  -1.180597 2.807959 0.882034
N  0.162777 0.329499 0.300341
C  -1.950113 3.717674 1.783782
C  -0.750234 3.725445 -0.219482
C  -1.978766 1.63843 0.434655
C  -2.743478 4.710921 0.861586
C  -1.961591 4.679631 -0.494257
C  -1.138326 0.607238 -0.365264
C  -1.888674 -0.700318 -0.665314
C  1.321473 0.776927 -0.313722
C  0.118482 -0.197953 1.673163
C  -1.172819 -1.760909 -1.283231
C  -3.265533 -0.890859 -0.385021
C  2.652624 0.584237 0.42904
C  -1.812137 -2.97434 -1.610791
C  -3.909512 -2.107435 -0.713173
C  3.216756 -0.830543 0.278136
C  -3.187236 -3.153679 -1.327177
C  3.709204 -1.541898 1.400829
C  3.280971 -1.443064 -1.001148
C  4.25684 -2.837602 1.252779
C  3.825793 -2.737024 -1.150122
C  4.316043 -3.44036 -0.023996
H  -1.227217 4.282802 2.403117
H  -2.599107 3.139295 2.464146
H  -0.402675 3.163148 -1.099772
H  0.111525 4.313277 0.150735
H  -2.388953 1.158167 1.343914
H  -2.852176 1.91873 -0.205655
H  -3.788243 4.37937 0.724843
H  -2.774269 5.724171 1.29948
H  -2.597715 4.285079 -1.306876
H  -1.620885 5.683218 -0.803362
H  -0.848757 1.057978 -1.334713
H  -0.773388 -0.839385 1.7793
H  0.998886 -0.825297 1.882088
H  0.057733 0.625696 2.410748
H  -0.106354 -1.628496 -1.498831
H  -3.851296 -0.095573 0.087118
H  2.560202 0.846271 1.497789
H  3.343964 1.311205 -0.033238
H  -1.240656 -3.779188 -2.086847
H  -4.974669 -2.235381 -0.488319
H  -3.686276 -4.095557 -1.58129
H  3.67409 -1.076867 2.394603
H  2.907825 -0.894831 -1.87483
H  4.63553 -3.372948 2.130989
H  3.872518 -3.196133 -2.144363
H  4.740107 -4.443943 -0.141068
