program: Gaussian 09
title: 000190924
version: EM64L-G09RevD.01
frameworkgroup: C1[X(C25H29IN2O)]
method: RPBEPBE
basis: SDD
operation: Freq
keyword: #p
keyword: freq=noraman
keyword: PBEPBE/SDD
title: #p freq=noraman PBEPBE/SDD
converged: YES YES NO NO
title: Mulliken charges:
elementType: I O N N C C C C C C C C C C C C C C C C C C C C C C C C C H H H H H H H H H H H H H H H H H H H H H H H H H H H H H
charge: 0.077218 -0.446751 -0.157755 -0.091408 0.160557 -0.072970 -0.479886 -0.465026 -0.405595 -0.405384 -0.077984 -0.453149 0.295152 -0.439297 -0.308085 -0.375430 0.296047 -0.456244 -0.478945 -0.439964 -0.424046 -0.247894 0.459842 -0.231717 -0.296293 -0.447500 -0.327359 -0.206085 -0.194489 0.237367 0.217114 0.225845 0.225083 0.216483 0.207790 0.223993 0.225143 0.195974 0.173859 0.223656 0.193347 0.226694 0.215324 0.252515 0.185586 0.237159 0.249374 0.197191 0.225239 0.242348 0.340149 0.244074 0.224823 0.225095 0.286890 0.238199 0.232933 0.251194
chargesum: 0.00000
title: Mulliken charges with hydrogens summed into heavy atoms:
elementType: I O N N C C C C C C C C C C C C C C C C C C C C C C C C C
charge: 0.077218 -0.106601 -0.157755 -0.091408 0.160557 0.164397 -0.036926 -0.023461 0.026188 0.015733 0.095875 -0.036147 0.295152 0.002722 -0.055569 0.047315 0.296047 -0.206870 -0.056515 -0.197617 -0.179972 -0.023071 0.459842 -0.006622 -0.009404 -0.209302 -0.327359 0.026847 0.056705
polarizability: 4.18417850e+02 1.34872986e+01 2.72152534e+02 4.24874773e+00 -3.19680624e+01 2.28840111e+02
1716.lowfreq: -5.1738 -0.0009 -0.0007 0.0004 2.0833 8.8188 9.2142 20.0663 22.2109
frequency: 8.5636 20.0193 21.6519 34.4364 43.2339 55.3748 87.0087 91.7939 103.8358 119.2789 138.2096 149.7544 175.6798 196.9938 208.6820 212.8888 242.4221 245.4401 249.4764 260.0134 273.1243 287.1881 299.4501 324.8872 343.2968 359.8661 375.7486 413.6575 422.9356 428.3492 438.7105 458.5648 466.3104 478.1313 495.6729 509.3234 545.1545 552.7200 579.6977 585.7296 597.8424 612.5546 619.0451 646.7673 656.4664 662.1235 690.7840 735.7203 750.1393 757.9204 763.4556 768.3857 787.6441 794.2356 810.0813 831.4422 850.2448 851.2577 878.4015 894.7959 904.1114 922.0717 931.5350 936.4194 948.1397 949.5151 952.3522 955.6411 977.8509 981.2534 981.7351 984.0107 997.3894 1014.7245 1019.2202 1020.6382 1038.8684 1048.8597 1057.6888 1064.6156 1073.0335 1075.4675 1090.8421 1099.5088 1111.2739 1119.0051 1120.8084 1132.0784 1141.6905 1143.3329 1157.5761 1168.7838 1169.7138 1177.8858 1181.3473 1195.6254 1199.2819 1216.6809 1230.9265 1241.8679 1260.2080 1262.5358 1264.6849 1274.8869 1284.8875 1289.5088 1295.0237 1300.6462 1307.7419 1317.5185 1320.4805 1331.3001 1336.4417 1343.3640 1345.6272 1354.6431 1360.6096 1370.7724 1382.0742 1389.1913 1404.4817 1407.9500 1415.4244 1444.1092 1445.6054 1452.4330 1454.8073 1458.4207 1459.1786 1462.8942 1469.2418 1474.7213 1476.6976 1480.9818 1557.9493 1569.2827 1599.3236 1599.3761 1618.1410 2833.5370 2839.9362 2855.5614 2871.2666 2887.1132 2893.4658 2987.9747 2988.8940 2992.0569 3002.3981 3008.1034 3016.4439 3031.4723 3038.1699 3048.4094 3055.7165 3058.9827 3073.2140 3117.5296 3121.5428 3126.8127 3141.0357 3146.3453 3155.6990 3158.0081 3160.2755 3171.5630 3186.4616 3353.3178
redmass: 9.1245 5.6285 5.7949 5.1929 4.6175 4.3674 5.4048 4.6147 3.6122 3.2265 6.2246 4.9077 4.5619 3.6894 3.3931 3.3799 3.3305 3.5729 3.3041 4.3729 3.5380 3.5498 2.1960 2.8246 2.1409 2.3594 2.4082 2.7043 2.7993 2.9284 3.4783 3.5894 3.5375 3.0647 3.5732 4.3481 5.3088 3.1504 3.0060 4.5921 3.3131 1.2858 2.8725 6.7667 3.5679 3.1960 2.5035 4.7365 1.6188 1.6468 2.3715 2.0464 1.7551 1.8867 1.5287 3.4305 3.1005 3.5834 1.4289 1.9025 1.3941 1.3437 2.8160 1.6004 1.9118 1.8291 1.5305 2.2577 1.7223 1.5796 4.1063 1.3230 2.6127 2.0638 1.8306 1.8476 4.9602 2.4255 2.2093 2.6154 1.6941 2.2778 1.8725 2.2545 2.3423 3.5435 1.3755 2.4632 2.4726 1.6679 2.2648 1.5931 1.1648 1.0858 1.0807 2.1820 2.3736 1.2735 2.0703 1.3514 1.3648 1.4408 1.5831 1.2069 1.3409 1.5580 1.4844 1.3486 1.2267 1.3715 1.3225 1.3672 1.8246 1.4185 1.5493 1.5631 1.4667 2.7839 1.6905 1.5556 4.2702 1.6271 2.1773 1.0885 2.4264 1.6775 1.0972 1.3319 3.2731 1.0907 1.1012 1.0776 1.1011 1.0930 5.9131 6.4827 6.7947 6.5662 7.2661 1.0718 1.0700 1.0698 1.0704 1.0714 1.0805 1.0867 1.0602 1.0608 1.0827 1.0615 1.0889 1.0878 1.0891 1.0874 1.1027 1.1028 1.1034 1.0867 1.0881 1.0884 1.0941 1.0926 1.0870 1.0921 1.1001 1.0977 1.1051 1.0639
irintensity: 0.0433 0.1939 0.2111 0.2587 0.0865 0.0634 1.1713 0.1886 0.9796 0.1480 0.5508 1.5123 1.9083 1.1693 1.1200 0.9573 3.2653 8.4799 0.9953 4.2329 0.7199 5.2402 3.5953 1.1340 2.3654 3.5960 10.5773 2.7003 6.0380 2.0689 9.0924 5.3592 0.7992 1.4555 0.5201 2.2960 0.8942 1.9329 1.3142 4.7934 11.7346 65.0253 4.9898 31.1195 1.7942 1.4081 23.5220 7.6368 1.7450 52.0732 27.1606 8.4884 55.9340 49.3668 0.4246 18.8869 12.4542 3.0216 2.9760 8.4947 4.8258 8.5532 21.1411 2.9242 3.0716 2.3334 5.8633 22.6641 3.0046 1.5777 10.0825 0.2008 59.5070 6.7308 6.5629 5.4049 81.3216 1.2536 15.2530 22.1674 5.5122 36.9199 13.7804 15.0803 22.7160 1.4553 1.5852 41.3472 14.5299 5.5760 30.3563 6.3042 0.3315 1.6505 5.6827 4.1312 34.8181 12.5652 2.6257 1.6011 11.9016 13.0945 8.5246 29.4900 10.3277 0.2058 10.7647 18.1825 1.5394 5.8993 0.8464 12.4538 0.2801 19.1663 8.8614 7.4301 7.1461 4.6783 21.7222 5.2336 3.0232 22.5381 32.8509 5.6621 6.0693 41.1843 8.7824 7.1870 20.4320 10.2364 2.7460 0.7129 7.5471 19.4878 1.2568 57.5736 0.4333 30.4030 0.3196 50.9349 58.0681 129.2867 54.6586 42.4087 118.1319 14.7449 17.5568 18.6427 14.7103 28.5285 25.1038 44.4720 31.4737 37.9989 16.5625 35.1094 33.7977 6.5439 8.3029 3.7555 30.6365 15.6461 5.5071 0.6319 39.2624 14.7490 16.8531 99.0532
temp: 298.150 k
press: 1.00000 atm
elementType: 53 8 7 7 6 6 6 6 6 6 6 6 6 6 6 6 6 6 6 6 6 6 6 6 6 6 6 6 6 1 1 1 1 1 1 1 1 1 1 1 1 1 1 1 1 1 1 1 1 1 1 1 1 1 1 1 1 1
symmnumber: 1
zpe: 1267804.9 jmol-1
zpe.correction: 0.482881 hartree
zpe.thermalcorrener: 0.508738 hartree
zpe.thermalcorrenthalpy: 0.509682 hartree
zpe.thermalcorrgfe: 0.423395 hartree
zpe.sumelectzpe: -1164.133329 hartree
zpe.sumelectthermal: -1164.107472 hartree
zpe.sumelectthermalent: -1164.106528 hartree
zpe.sumelectthermalfe: -1164.192815 hartree
dipole: -1.4105 3.2818 -2.8056
dipole: 4.5421
quadrupole: -184.5107 -178.7516 -196.6638
quadrupole: 11.8107 2.1370 -3.1178
quadrupole: 2.1313 7.8904 -10.0218 11.8107 2.1370 -3.1178
hfenergy: -1164.61621 hartree
pointgroup: C01 [X(C25H29I1N2O1)]
dipole: 0.4141536 -1.4502727 0.9584446 debye
polarizability: 419.2228365|3.4634247|251.4055238|8.4976902|-38.3317162|248.7821356 unknown
InChI: InChI=1S/C25H29IN2O/c26-21-6-3-4-19(16-21)17-27-13-9-24(29)23(18-27)28-14-11-25(12-15-28)10-8-20-5-1-2-7-22(20)25/h1-8,10,16,23-24,29H,9,11-15,17-18H2
charge 0 multiplicity 1
58 atoms
I  -7.083039 0.567387 -3.289685
O  -0.194281 3.311717 0.354375
N  0.882742 0.756105 -0.017414
N  -2.852789 -0.009078 0.517365
C  3.678465 -0.271746 -0.151066
C  -0.597538 0.908604 0.065645
C  3.085633 0.450032 1.103531
C  2.87846 0.208929 -1.40643
C  1.559375 0.264004 1.212822
C  1.356931 0.039306 -1.229677
C  -0.940697 2.175231 0.887726
C  -1.400839 -0.303047 0.605665
C  5.179086 -0.004688 -0.300921
C  -2.449113 2.443023 0.814569
C  3.653534 -1.798677 -0.003589
C  -3.228844 1.202693 1.29639
C  5.896426 -1.238607 -0.243402
C  4.916765 -2.325838 -0.058554
C  -3.691149 -1.181295 0.854411
C  5.863598 1.20901 -0.473601
C  7.303703 -1.262264 -0.359297
C  7.278728 1.188248 -0.590514
C  -5.128299 -1.058415 0.352087
C  7.99001 -0.03561 -0.533804
C  -5.386997 -0.437877 -0.897143
C  -6.205765 -1.602038 1.091242
C  -6.706807 -0.379869 -1.383489
C  -7.524363 -1.538726 0.587123
C  -7.789912 -0.925803 -0.659477
H  -0.947774 1.100246 -0.968102
H  3.308124 1.531931 1.029513
H  3.575808 0.06712 2.017848
H  3.216791 -0.349519 -2.298844
H  3.09671 1.28086 -1.576163
H  1.330583 -0.811922 1.405631
H  1.181546 0.83648 2.078823
H  0.835945 0.464358 -2.107179
H  1.103377 -1.049254 -1.193475
H  -0.659147 2.004553 1.954622
H  -1.186882 -1.203003 -0.002367
H  -1.090147 -0.525311 1.659498
H  -2.721543 2.680979 -0.230004
H  -2.706562 3.317878 1.438855
H  2.731957 -2.371576 0.125374
H  -3.04074 1.041712 2.390743
H  -4.313381 1.369061 1.173483
H  5.176624 -3.385217 0.019458
H  -3.708962 -1.387256 1.955258
H  -3.224271 -2.067304 0.378212
H  5.325016 2.163323 -0.51923
H  0.671307 2.907302 0.048109
H  7.857281 -2.207198 -0.315995
H  7.827271 2.127139 -0.726141
H  9.082074 -0.029819 -0.62618
H  -4.545726 -0.004869 -1.446405
H  -6.015003 -2.07343 2.063048
H  -8.355379 -1.959839 1.163533
H  -8.810924 -0.873234 -1.047514
