program: Gaussian 09
title: 000190964
version: EM64L-G09RevD.01
frameworkgroup: C1[X(C18H22IN7O4)]
method: RPBEPBE
basis: SDD
operation: Freq
keyword: #p
keyword: freq=noraman
keyword: PBEPBE/SDD
title: #p freq=noraman PBEPBE/SDD
converged: YES YES NO NO
title: Mulliken charges:
elementType: I O O O O N N N N N N N C C C C C C C C C C C C C C C C C C H H H H H H H H H H H H H H H H H H H H H H
charge: 0.052602 -0.295967 -0.438203 -0.452134 -0.433598 -0.193210 -0.080548 -0.084038 -0.106286 -0.332365 -0.625574 -0.686383 -0.133251 -0.068882 -0.248595 -0.038678 -0.323881 0.197776 -0.228922 -0.162254 0.171534 0.008802 -0.397587 -0.564130 0.510874 -0.354888 -0.409460 -0.551721 -0.384706 0.622056 0.245568 0.295788 0.234746 0.259996 0.177135 0.229139 0.365728 0.366949 0.255416 0.358820 0.327976 0.220619 0.248607 0.242818 0.207782 0.341648 0.327281 0.260341 0.230799 0.218837 0.309713 0.305910
chargesum: 0.00000
title: Mulliken charges with hydrogens summed into heavy atoms:
elementType: I O O O O N N N N N N N C C C C C C C C C C C C C C C C C C
charge: 0.052602 -0.295967 -0.072475 -0.085186 -0.074778 -0.193210 -0.080548 -0.084038 -0.106286 -0.004389 0.043355 -0.070759 0.112317 0.226906 -0.013849 0.221319 0.082394 0.197776 0.026495 -0.162254 0.171534 0.008802 0.071639 -0.113531 0.510874 -0.094547 -0.178661 -0.551721 -0.165869 0.622056
polarizability: 3.86191373e+02 5.15648622e+00 2.99598575e+02 -2.71661572e+01 3.97324251e+01 1.95173622e+02
1716.lowfreq: -6.7617 -4.6358 -4.2094 0.0005 0.0008 0.0011 4.9639 7.5255 7.6553
frequency: -4.1463 7.2271 7.3914 12.8517 25.4669 39.1458 51.9998 56.9673 73.3593 94.0135 108.2099 112.1280 127.1241 156.7660 167.5877 179.4915 186.4376 204.3147 217.3409 232.3766 241.0799 244.9580 261.8817 280.1158 291.1208 300.2893 316.7889 333.1167 346.6508 365.5390 376.3867 403.9461 405.8404 411.1389 434.1631 439.3940 452.8160 454.1105 482.2308 490.0496 501.8747 513.9103 537.1832 541.6733 546.7528 552.7745 585.9654 596.2528 609.3172 636.8887 651.0032 656.3510 661.7230 684.1491 708.2178 712.7899 720.1872 735.8128 761.3395 779.3993 794.8384 811.2723 816.2573 821.3757 842.0364 854.7331 878.2091 892.3071 917.3682 924.5261 943.7259 960.6851 976.2007 991.8261 1006.5861 1010.3604 1013.1903 1018.5045 1028.6824 1036.6990 1041.4068 1047.3446 1063.4565 1108.6854 1128.7526 1153.9645 1156.7589 1167.1837 1182.3635 1186.6566 1198.6356 1200.4047 1209.4481 1233.6852 1263.3239 1265.4095 1268.0948 1279.7974 1286.5299 1298.3022 1302.8732 1306.9183 1316.6005 1319.5572 1325.1661 1338.9555 1351.5474 1357.9167 1370.4364 1378.6043 1385.0794 1390.2146 1398.9517 1403.0275 1407.8181 1442.2541 1452.0504 1456.9017 1469.3948 1470.5182 1505.1657 1544.8432 1550.5840 1568.7801 1581.7603 1615.4731 1628.1530 1637.2372 2942.3476 2991.7626 2997.1855 3007.0584 3011.0498 3021.5047 3056.2043 3057.3161 3079.9195 3081.1019 3113.3943 3137.5053 3152.8850 3234.9675 3443.0625 3542.0192 3544.3601 3549.5900 3575.4063 3585.5210 3692.5735 3700.0314
redmass: 7.2868 7.9889 9.7376 6.3950 6.2161 5.6915 7.2952 5.4789 6.4281 4.9106 4.2324 7.0284 4.5386 5.4846 4.3472 3.8987 5.6603 5.4609 7.2793 6.4313 3.1099 3.2028 3.6749 2.6576 2.7089 3.9549 4.1181 3.4435 2.7630 1.2444 3.3841 3.7679 3.2089 1.4787 2.3481 3.4758 2.2876 1.4074 4.0852 1.2659 3.6547 3.1822 1.1111 1.4747 2.4721 1.2827 3.7978 3.2077 5.0083 4.2558 4.5804 6.3824 6.9069 5.1748 6.3126 9.0661 3.6847 3.8987 1.7670 5.5189 5.3329 2.4875 1.9866 5.2352 4.9964 2.2245 3.2513 1.5981 4.3042 2.9499 1.3729 2.9540 4.5961 4.1753 2.9523 1.8745 2.4663 3.1727 3.4724 1.8136 3.0077 2.9057 4.1387 1.9534 2.8621 1.3357 1.2225 1.7051 1.5161 1.3400 1.4835 1.3894 1.8787 2.2777 1.6285 1.2494 1.5132 1.5962 1.3926 2.3086 2.7939 1.5714 1.6040 1.3787 1.8788 1.2312 1.4441 1.4515 4.0064 2.4930 1.6060 1.8662 1.5638 2.4302 3.9499 1.3608 3.1705 1.1061 1.1678 2.1422 3.5168 3.5010 6.5431 2.2792 7.4361 2.0907 2.3335 1.9373 1.0689 1.0611 1.0850 1.0625 1.0871 1.0856 1.0996 1.0867 1.0942 1.1033 1.0866 1.0967 1.0924 1.0974 1.0645 1.0464 1.0441 1.0658 1.0769 1.0668 1.1025 1.1057
irintensity: 1.0381 0.8087 0.2473 0.6887 0.1170 1.7755 0.2372 1.6915 4.5246 11.1888 1.2423 1.1331 0.3162 6.2772 2.2983 3.9123 6.9779 1.7865 3.8737 7.9247 5.7451 17.1127 4.2766 28.4952 3.2877 2.2435 9.8048 19.5984 20.7793 128.9319 22.5137 6.7368 12.8064 141.0445 7.2924 4.6339 36.0932 109.7182 4.1898 211.9420 12.9642 0.8457 26.4763 116.8004 16.0297 191.1127 25.5160 6.8321 2.6703 32.9065 6.9782 10.0235 0.7850 21.7813 70.8378 7.3489 6.9042 17.9972 35.4655 22.4055 1.6411 31.3697 24.4431 36.2709 5.1710 8.6545 20.8453 5.7845 207.3642 1.2058 0.3941 25.6709 94.6175 109.2451 35.6114 0.4298 24.5650 61.0964 56.5224 8.0491 32.5485 23.3094 36.9269 20.4848 13.7744 7.9381 49.1796 12.1582 21.3891 20.9980 12.4443 38.4041 14.5355 86.7599 43.0251 13.1662 5.7941 2.7671 5.1361 21.5583 5.4956 20.1400 74.6631 31.8277 23.2198 19.1930 70.9904 96.7734 43.0685 95.4793 45.1761 44.6462 11.7634 40.8857 3.6877 80.0898 60.2516 13.8117 12.9469 77.9753 209.9218 508.2495 6.4448 93.8096 570.4573 9.5631 488.6525 274.9499 56.0887 28.9208 13.8776 42.5987 22.5953 64.3891 26.3765 2.1522 28.5277 16.8945 14.9183 29.4834 5.5143 0.3006 52.8035 60.8362 110.9965 11.6698 66.0331 23.2764 37.5965 45.8345
temp: 298.150 k
press: 1.00000 atm
elementType: 53 8 8 8 8 7 7 7 7 7 7 7 6 6 6 6 6 6 6 6 6 6 6 6 6 6 6 6 6 6 1 1 1 1 1 1 1 1 1 1 1 1 1 1 1 1 1 1 1 1 1 1
symmnumber: 1
zpe: 1053661.9 jmol-1
zpe.correction: 0.401319 hartree
zpe.thermalcorrener: 0.429544 hartree
zpe.thermalcorrenthalpy: 0.430488 hartree
zpe.thermalcorrgfe: 0.337248 hartree
zpe.sumelectzpe: -1392.566800 hartree
zpe.sumelectthermal: -1392.538575 hartree
zpe.sumelectthermalent: -1392.537630 hartree
zpe.sumelectthermalfe: -1392.630870 hartree
dipole: 2.3752 -0.1065 3.0960
dipole: 3.9036
quadrupole: -174.2071 -180.4987 -179.4011
quadrupole: -12.4702 -38.6185 4.5995
quadrupole: 3.8285 -2.4631 -1.3655 -12.4702 -38.6185 4.5995
hfenergy: -1392.9681184 hartree
pointgroup: C01 [X(C18H22I1N7O4)]
dipole: -0.8548462 0.414934 1.2065535 debye
polarizability: 385.8876764|23.0842172|258.9726531|13.3018914|-65.3521942|236.1032405 unknown
InChI: InChI=1S/C18H22IN7O4/c19-9-5-8(1-2-10(9)20)3-4-22-18-24-15(21)12-16(25-18)26(7-23-12)17-14(29)13(28)11(6-27)30-17/h1-2,5,7,11,13-14,17,22,27-29H,3-4,6,20-21H2
charge 0 multiplicity 1
52 atoms
I  -5.866097 -1.133039 2.62831
O  4.294729 0.69676 -0.876559
O  2.775629 3.183303 0.49592
O  5.256062 3.260977 1.52868
O  6.991102 0.751901 -1.857662
N  2.555276 -0.46039 0.286671
N  2.550672 -2.520069 1.302054
N  0.273756 -0.47886 -0.684444
N  -0.932594 -2.575011 -0.155325
N  -1.915741 -0.911942 -1.456198
N  0.019396 -4.304144 1.135124
N  -8.022804 0.325245 0.552183
C  3.245382 1.885275 0.964439
C  2.998314 0.851486 -0.169408
C  4.798708 1.927841 1.111541
C  5.282103 1.66394 -0.326443
C  6.656984 1.009814 -0.458739
C  1.297826 -1.024969 0.018261
C  3.263613 -1.409302 1.058767
C  1.317545 -2.289491 0.659854
C  0.124983 -3.069925 0.547651
C  -0.812987 -1.324046 -0.739868
C  -2.035947 0.408344 -2.078038
C  -2.59058 1.505618 -1.115255
C  -4.010741 1.229703 -0.652052
C  -4.261496 0.412794 0.48099
C  -5.133948 1.7300 -1.360918
C  -5.578847 0.11172 0.878406
C  -6.448624 1.43118 -0.964045
C  -6.715299 0.607601 0.173259
H  2.723777 1.597515 1.897369
H  2.224646 1.235339 -0.856864
H  5.154905 1.142293 1.80746
H  5.241472 2.604398 -0.909675
H  6.675116 0.07014 0.137495
H  7.437546 1.694467 -0.086386
H  3.446355 3.858465 0.798086
H  5.346348 3.301939 2.513165
H  4.294353 -1.252441 1.366317
H  6.245318 0.23034 -2.253091
H  -2.721858 -1.536025 -1.413496
H  -2.699461 0.317542 -2.957955
H  -1.033396 0.712544 -2.423718
H  -1.897662 1.579921 -0.257207
H  -2.546852 2.473217 -1.65213
H  0.807311 -4.680867 1.656988
H  -0.845869 -4.829936 1.035947
H  -3.417351 0.016271 1.054014
H  -4.975469 2.371404 -2.236841
H  -7.298741 1.83765 -1.525792
H  -8.211908 -0.256871 1.365256
H  -8.804158 0.70358 0.025703
