program: Gaussian 09
title: 000190823
version: EM64L-G09RevD.01
frameworkgroup: C1[X(C10H8O2)]
method: RPBEPBE
basis: SDD
operation: Freq
keyword: #pfreq=noraman
keyword: PBEPBE/SDD
title: #p freq=noraman PBEPBE/SDD
converged: YES YES NO NO
title: Mulliken charges:
elementType: O O C C C C C C C C C C H H H H H H H H
charge: -0.268691 -0.426308 -0.074502 -0.213044 -0.373642 0.103376 -0.062742 0.001984 -0.010408 -0.754389 -0.029663 0.051040 0.242831 0.250056 0.213521 0.231018 0.343013 0.258681 0.258825 0.259045
chargesum: 0.00000
title: Mulliken charges with hydrogens summed into heavy atoms:
elementType: O O C C C C C C C C C C
charge: -0.268691 -0.083295 0.168329 0.037012 0.070897 0.103376 -0.062742 0.001984 -0.010408 0.022162 -0.029663 0.051040
polarizability: 3.51375613e+02 1.98666798e+01 6.94806592e+01 5.59478680e+00 3.01513778e+00 6.49808396e+01
1716.lowfreq: -20.8393 -9.1893 -0.0008 -0.0007 -0.0004 2.2673 3.7739 31.3240 39.4840
frequency: -20.6575 31.1609 39.4838 67.0801 91.4887 101.2552 166.2970 197.3692 227.8016 270.9362 310.7417 317.6970 346.2592 380.7196 425.9703 438.2097 464.9473 487.5038 507.1025 518.3087 562.3348 681.6407 800.0415 836.5711 934.3570 951.6396 1009.6749 1020.9106 1021.6614 1060.5701 1092.3915 1114.2052 1174.1129 1217.3773 1294.0581 1320.6950 1354.1467 1383.3882 1399.9163 1437.5220 1452.4228 1452.9960 1467.5796 2124.4032 2245.2452 2264.5791 2970.3211 2977.7807 3059.5378 3060.0779 3075.1428 3090.5638 3098.9476 3566.2314
redmass: 1.0292 5.5768 5.1421 3.9340 4.5099 4.8148 5.2974 4.8030 5.2333 1.4857 5.1218 3.3725 3.1707 4.3131 6.9212 8.1555 8.8630 9.4157 10.9829 10.7081 6.6024 9.0550 3.8761 5.1888 1.9681 4.2527 1.4727 1.3910 1.3869 1.5856 1.3932 5.4061 1.3828 1.5838 1.2160 1.2884 1.3594 1.8793 1.3261 4.9656 1.0404 1.0406 1.0849 11.8422 11.9438 11.8280 1.0349 1.0678 1.0980 1.0982 1.0906 1.0888 1.0951 1.0666
irintensity: 0.0362 1.3585 0.7247 1.8041 7.4080 3.1798 4.7783 2.0676 21.3344 121.4102 4.5913 26.7640 68.0678 15.9296 7.0148 18.4527 1.3562 17.6433 4.3319 6.7539 16.0854 47.1380 12.5419 16.0771 21.5879 92.4692 44.0551 5.8750 6.5079 6.5321 4.3674 10.1097 18.1323 6.9070 50.8658 8.2033 22.7567 0.7618 0.0884 14.3512 15.4477 15.5116 8.4957 11.7421 46.3890 40.7459 33.3951 67.8140 8.2860 8.3761 4.5552 13.7322 33.8671 12.0651
temp: 298.150 k
press: 1.00000 atm
elementType: 8 8 6 6 6 6 6 6 6 6 6 6 1 1 1 1 1 1 1 1
symmnumber: 1
zpe: 376604.6 jmol-1
zpe.correction: 0.143441 hartree
zpe.thermalcorrener: 0.156246 hartree
zpe.thermalcorrenthalpy: 0.157190 hartree
zpe.thermalcorrgfe: 0.102484 hartree
zpe.sumelectzpe: -535.240561 hartree
zpe.sumelectthermal: -535.227756 hartree
zpe.sumelectthermalent: -535.226812 hartree
zpe.sumelectthermalfe: -535.281517 hartree
dipole: 2.3791 1.8313 1.3063
dipole: 3.2742
quadrupole: -35.0934 -74.1783 -66.7605
quadrupole: -0.4669 -4.9279 6.6077
quadrupole: 23.5840 -15.5009 -8.0831 -0.4669 -4.9279 6.6077
hfenergy: -535.3840017 hartree
pointgroup: C01 [X(C10H8O2)]
dipole: -0.9515068 0.6670526 -0.5558917 debye
dipolederiv: -0.9144798 0.0176328 -0.014966 0.4353044 -0.6483929 -0.092196 0.2161134 -0.0948335 -0.3000049 -0.789385 -0.0937316 0.1102109 -0.3644442 -0.7774273 -0.0318497 0.041575 -0.0621327 -0.1216645 0.2899796 -0.0026518 0.0494873 0.0807212 0.2268965 -0.0579148 -0.3205828 -0.0032023 0.2736826 0.8529917 -0.0673226 0.0798499 -0.5184315 0.2770819 0.0849212 0.1769535 0.0052531 0.2515075 0.469447 0.0326891 -0.1010545 0.2957437 0.6307396 0.0073354 0.1230513 0.0286461 0.1999344 -0.3740012 0.0525681 -0.0548805 -0.1012869 -0.1163981 -0.0151407 -0.1232348 0.0034743 -0.1563005 0.2538034 -0.0388067 0.0651722 0.0065108 -0.0037055 0.0121323 0.0146094 0.0125062 -0.0088894 -0.2092549 0.0223889 -0.0160256 0.0091556 -0.0386714 -0.0121831 -0.0130079 -0.0090603 -0.0326844 0.5364604 -0.0483783 0.0383548 -0.0429101 0.0039666 0.005425 0.0380987 0.0029399 0.0023735 -0.1395736 0.019332 -0.0126394 0.0295146 0.0708842 -0.0004631 -0.0005365 -0.001704 0.0726453 -0.5697531 0.0442142 -0.0299859 0.0431598 -0.0420645 -0.0033717 -0.0380661 -0.0013029 -0.0396868 0.5498753 -0.0569841 0.0430377 -0.053528 -0.1087619 0.0005291 0.0402923 0.000148 -0.1115879 0.00312 -0.0022342 -0.0572754 -0.0331634 0.0294298 0.0869428 -0.0501404 0.097731 -0.0549907 -0.1290318 0.026504 -0.0717188 0.0958852 0.1126045 -0.0192652 -0.0291758 -0.0327893 -0.0317287 -0.165508 0.0179908 0.1107278 -0.0224355 -0.0353403 -0.0461069 0.1354514 -0.1011334 -0.052113 0.1029183 -0.0010145 -0.0250051 0.0134028 0.0089754 0.0535918 -0.0804898 0.0818568 -0.0508295 0.4353938 0.0546252 -0.0994854 0.1086483 0.2824599 0.0265386 -0.0987243 0.0710404 0.0321298 -0.0597818 0.0553567 0.0095965 0.0894243 -0.0243141 -0.0743727 0.019759 -0.0770127 0.1026926 -0.0537633 0.0131463 -0.051401 0.0095266 0.138036 -0.003906 -0.0930425 -0.0006778 -0.0625473 -0.0894571 -0.0453243 0.0280005 -0.0807978 0.0140013 0.0793539 0.0410968 0.080253 0.0880619 unknown
polarizability: 351.9620429|-15.743084|68.5405334|3.6870114|-3.0401458|65.3345358 unknown
InChI: InChI=1S/C10H8O2/c1-2-3-4-5-6-7-9-10(8-11)12-9/h9-11H,8H2,1H3
charge 0 multiplicity 1
20 atoms
O  3.24574 -1.559447 -0.40622
O  4.936836 1.846576 -0.087328
C  3.496222 -0.092477 -0.627578
C  2.550663 -0.49735 0.475767
C  4.901683 0.393082 -0.309379
C  1.127132 -0.372614 0.347096
C  -0.111765 -0.274106 0.259137
C  -1.461718 -0.154997 0.158307
C  -2.70528 -0.04669 0.066137
C  -6.748237 0.307857 -0.228028
C  -4.057699 0.07249 -0.032576
C  -5.294146 0.180485 -0.122539
H  3.04451 0.29174 -1.554852
H  2.95461 -0.485703 1.497585
H  5.597256 0.088996 -1.119289
H  5.250508 -0.051716 0.636206
H  4.760167 2.316901 -0.940956
H  -7.097258 1.257942 0.218202
H  -7.073782 0.291733 -1.285026
H  -7.26054 -0.520203 0.296633
