program: Gaussian 09
title: 000182508
version: EM64L-G09RevD.01
frameworkgroup: C1[X(C20H20N2O2)]
method: RPBEPBE
basis: SDD
operation: Freq
keyword: #p
keyword: freq=noraman
keyword: PBEPBE/SDD
title: #p freq=noraman PBEPBE/SDD
converged: YES YES NO NO
title: Mulliken charges:
elementType: O O N N C C C C C C C C C C C C C C C C C C C C H H H H H H H H H H H H H H H H H H H H
charge: -0.261108 -0.318438 -0.458231 -0.423374 -0.155804 -0.579319 0.126733 0.164630 0.188921 0.225689 -0.787635 -0.780508 0.479886 0.489164 -0.450875 -0.452469 -0.350352 -0.342931 -0.197625 -0.196542 -0.215987 -0.214217 -0.256812 -0.251088 0.210943 0.302964 0.226078 0.220018 0.252214 0.222101 0.226697 0.239063 0.372525 0.312712 0.233627 0.221547 0.303566 0.309471 0.224199 0.229323 0.223923 0.229170 0.226407 0.231747
chargesum: 0.00000
title: Mulliken charges with hydrogens summed into heavy atoms:
elementType: O O N N C C C C C C C C C C C C C C C C C C C C
charge: -0.261108 -0.318438 -0.085706 -0.110662 -0.155804 -0.065412 0.126733 0.164630 0.188921 0.225689 -0.089325 -0.092647 0.479886 0.489164 -0.217248 -0.230922 -0.046786 -0.033460 0.026574 0.032781 0.007936 0.014952 -0.030405 -0.019341
polarizability: 3.23605916e+02 -2.44792822e+00 2.38505900e+02 8.90420441e+00 -3.11977317e+01 1.95200266e+02
1716.lowfreq: -2.5706 0.0002 0.0006 0.0007 2.8846 5.1113 17.1842 26.2150 33.5412
frequency: 17.1543 26.1813 33.5396 38.4438 57.0893 76.9414 84.5319 93.3506 104.3986 112.9925 135.1411 141.1259 168.6393 184.1097 208.3772 233.7764 258.0952 273.9016 299.4863 320.2905 335.4638 352.6001 361.2289 387.2882 407.7655 409.6527 456.5930 475.9271 507.6864 513.4244 533.7893 556.9583 584.7656 613.1942 614.2092 630.5301 667.6491 675.9379 697.4295 697.8064 732.0880 768.1793 770.0866 777.9855 811.1879 830.0709 841.0361 845.1741 866.0912 882.9845 902.8807 906.3046 920.6488 923.2441 943.4958 950.0276 971.6464 974.5750 975.6458 984.7311 985.4852 997.6629 1001.3954 1001.9077 1025.5386 1026.1492 1065.1308 1070.0147 1078.9378 1084.8848 1089.7374 1105.5569 1170.7910 1173.5528 1178.7564 1187.4175 1188.9472 1227.2348 1236.6381 1252.6276 1265.6670 1275.0386 1322.0681 1326.2144 1384.0286 1385.6168 1387.5790 1396.8044 1418.1836 1430.7227 1437.6337 1455.5044 1460.0491 1470.7135 1474.6306 1484.3439 1486.8571 1512.4213 1541.4938 1562.8328 1598.5759 1603.0199 1614.7067 1616.3554 1638.6113 1816.8287 2965.8264 2969.4301 3039.6169 3042.5075 3046.9616 3094.3706 3098.9541 3111.1285 3118.7699 3130.1403 3134.6547 3143.3521 3146.3023 3147.0558 3163.4335 3167.3578 3192.8652 3199.2880 3264.8711 3534.3175
redmass: 5.1413 4.6374 3.9219 3.7475 4.8136 7.0233 4.2915 3.1908 6.8130 4.0297 1.2319 2.8843 1.1107 5.9225 4.3308 4.4870 4.5305 4.1158 4.4672 2.9934 2.9341 5.8574 4.6799 7.2686 2.9138 2.9308 2.8946 5.0668 3.4000 3.0320 4.5142 4.5814 6.6143 6.2551 6.4616 5.2588 4.2042 1.3203 1.9733 1.9454 4.5661 1.7304 1.8080 4.8406 5.8798 4.2827 1.2627 1.2654 6.6567 1.3772 2.1008 2.8212 1.4332 1.4343 1.4156 1.4638 2.4799 1.3503 1.3573 6.1581 6.0572 1.3062 1.4759 1.3111 2.1966 2.1915 2.5160 1.3108 1.6647 1.7176 1.5977 2.3440 1.1058 1.0599 2.8150 1.1389 1.1164 3.6234 4.2604 2.9063 2.4502 2.4533 1.4000 1.4837 1.2715 7.1925 6.8889 1.2126 1.1598 2.4078 2.3653 1.0515 1.0470 1.0495 1.0729 2.3777 2.3940 2.5250 2.3886 4.8539 7.4575 4.7035 6.1099 5.8876 2.5405 9.6625 1.0373 1.0375 1.0973 1.0965 1.0561 1.0986 1.0986 1.0889 1.0871 1.0876 1.0868 1.0939 1.1118 1.0935 1.1000 1.0999 1.0950 1.0950 1.0813 1.0757
irintensity: 0.6377 0.9395 0.0441 0.0922 0.9539 0.5906 0.5227 0.5656 4.4023 2.7853 0.5594 1.0287 2.3714 8.7990 2.0566 15.0896 1.0247 1.5239 1.8982 6.3157 1.8433 5.0008 13.3733 13.6750 0.0747 0.0256 0.4061 9.1737 32.4951 4.1034 5.1731 18.2243 8.3673 0.1804 0.3719 8.6742 9.4539 10.0608 15.6102 75.5345 11.0815 50.2966 90.2158 6.8203 1.6097 0.4342 14.4204 0.3607 15.4993 41.2966 55.3904 62.7622 4.6720 55.4714 2.6653 6.6900 50.5492 0.5308 0.1371 0.3340 0.1628 2.9609 3.1968 3.1285 5.3408 3.4831 15.1413 4.7279 6.7707 29.0739 5.0743 17.0190 2.7864 0.8343 15.9499 1.8906 0.7970 60.1323 7.1548 14.0838 87.1228 10.1159 29.0285 78.8670 15.5575 51.2776 50.1274 8.7016 36.7889 207.4991 34.6461 1.4010 8.9233 26.5454 7.9457 69.5570 64.5856 865.9137 428.5403 40.4282 164.1773 26.2395 39.4112 25.7294 88.7396 3.2542 20.3466 58.7410 0.3788 37.7407 37.9509 19.6373 21.0579 13.4542 9.2120 2.0685 0.2929 32.2460 10.2748 26.7278 32.5589 26.8309 6.8517 7.7617 429.7000 17.0430
temp: 298.150 k
press: 1.00000 atm
elementType: 8 8 7 7 6 6 6 6 6 6 6 6 6 6 6 6 6 6 6 6 6 6 6 6 1 1 1 1 1 1 1 1 1 1 1 1 1 1 1 1 1 1 1 1
symmnumber: 1
zpe: 922031.4 jmol-1
zpe.correction: 0.351183 hartree
zpe.thermalcorrener: 0.373721 hartree
zpe.thermalcorrenthalpy: 0.374665 hartree
zpe.thermalcorrgfe: 0.296912 hartree
zpe.sumelectzpe: -1032.358966 hartree
zpe.sumelectthermal: -1032.336428 hartree
zpe.sumelectthermalent: -1032.335484 hartree
zpe.sumelectthermalfe: -1032.413237 hartree
dipole: -3.9091 1.1885 0.7074
dipole: 4.1466
quadrupole: -127.9508 -132.0872 -138.2183
quadrupole: -3.7659 10.2127 -2.9843
quadrupole: 4.8013 0.6649 -5.4662 -3.7659 10.2127 -2.9843
hfenergy: -1032.7101492 hartree
pointgroup: C01 [X(C20H20N2O2)]
dipole: -1.5627852 -0.4666044 0.0375037 debye
polarizability: 318.8261147|-7.7289691|223.1674558|-24.8548814|-36.436781|215.3185117 unknown
InChI: InChI=1S/C20H20N2O2/c1-14(2)17-13-20(17,18(23)21-15-9-5-3-6-10-15)19(24)22-16-11-7-4-8-12-16/h3-12,21-22H,13H2,1-2H3
charge 0 multiplicity 1
44 atoms
O  2.396822 -0.834523 1.952659
O  -0.698026 0.464283 -0.760259
N  1.939639 0.281545 -0.070896
N  -2.053601 0.208641 1.133617
C  0.123524 -0.938679 1.052971
C  -0.215745 -1.886846 2.261903
C  -0.081241 -2.436351 0.893782
C  1.599011 -0.475984 1.032232
C  -0.905799 -0.02999 0.404133
C  -0.091457 -3.459507 0.018525
C  0.173346 -3.246347 -1.461092
C  -0.363737 -4.881446 0.477126
C  3.206293 0.835213 -0.404424
C  -3.222468 0.939658 0.762555
C  3.275953 1.610756 -1.594745
C  -4.26137 1.025891 1.728362
C  4.37635 0.644543 0.379787
C  -3.379546 1.566014 -0.502179
C  4.496884 2.186736 -1.997707
C  -5.446574 1.729077 1.435263
C  5.591357 1.23012 -0.037984
C  -4.574337 2.264935 -0.780029
C  5.665084 2.000391 -1.221181
C  -5.611091 2.353586 0.176564
H  -1.204966 -1.851108 2.738774
H  0.624605 -2.001987 2.958431
H  1.082161 -3.795907 -1.775716
H  -0.664812 -3.639529 -2.068965
H  0.306862 -2.179939 -1.705375
H  -1.256156 -5.294444 -0.033047
H  0.486824 -5.541819 0.217672
H  -0.525834 -4.936709 1.566291
H  1.148313 0.477297 -0.713274
H  -2.062456 -0.182944 2.077824
H  2.371552 1.760684 -2.197602
H  -4.140841 0.544167 2.707696
H  4.3173 0.048624 1.292243
H  -2.5752 1.502837 -1.236332
H  4.535457 2.782195 -2.916728
H  -6.239397 1.789108 2.18868
H  6.489693 1.079573 0.571629
H  -4.691041 2.746883 -1.75708
H  6.61444 2.44851 -1.533597
H  -6.531473 2.900994 -0.052106
