program: Gaussian 09
title: 000182499
version: EM64L-G09RevD.01
frameworkgroup: C1[X(C13H10S2)]
method: RPBEPBE
basis: SDD
operation: Freq
keyword: #pfreq=noraman
keyword: PBEPBE/SDD
title: #p freq=noraman PBEPBE/SDD
converged: YES YES NO NO
title: Mulliken charges:
elementType: S S C C C C C C C C C C C C C H H H H H H H H H H
charge: 0.039412 0.038605 -0.204080 -0.182238 -0.215864 -0.231608 0.080953 0.071309 -0.274168 0.038366 -0.200007 0.050758 -0.743791 -0.076623 -0.576180 0.237713 0.237688 0.234918 0.246610 0.257728 0.254668 0.255950 0.218701 0.220911 0.220269
chargesum: 0.00000
title: Mulliken charges with hydrogens summed into heavy atoms:
elementType: S S C C C C C C C C C C C C C
charge: 0.039412 0.038605 0.033633 0.055449 -0.215864 -0.231608 0.080953 0.071309 -0.039250 0.038366 0.046604 0.050758 0.024555 0.142078 -0.135000
polarizability: 7.16530895e+02 7.60175998e+00 1.52227461e+02 2.58288603e+00 1.68819095e-01 7.92284167e+01
1716.lowfreq: -0.0015 -0.0009 0.0028 3.6613 4.5532 9.0358 25.5590 28.5888 31.8998
frequency: 25.3213 28.5667 31.8334 41.6700 68.3090 81.3961 106.4484 120.3498 154.8797 181.5629 207.4415 242.4809 247.3826 274.0313 282.8619 327.4015 394.8730 405.4612 423.5843 450.0415 456.7524 477.6533 513.7680 534.4547 545.2077 558.4798 599.6799 645.0364 653.5914 831.8674 858.0293 869.8012 904.2004 924.6969 934.0132 951.3403 954.1078 1011.5056 1022.8994 1027.0275 1041.6926 1187.9021 1213.3368 1249.7326 1267.7397 1275.1095 1295.8676 1305.2362 1317.3744 1399.7972 1432.9072 1455.1055 1456.1151 1530.4896 1570.6186 1600.7814 1625.0688 2176.0483 2236.5338 2972.9419 3058.5253 3066.7271 3080.6113 3090.8727 3101.9311 3111.7293 3121.0791 3131.2633 3209.6414
redmass: 4.9529 5.0195 1.0213 3.3630 4.8133 3.7841 3.5035 5.4625 4.6540 3.9250 6.2473 9.8335 3.5957 4.2230 4.3090 4.5323 5.7956 8.7630 5.7600 9.0509 8.3462 4.9885 3.6531 4.9619 6.2543 5.3574 6.5178 1.4875 6.6042 1.4486 4.2367 1.8275 1.5738 1.1772 2.8398 1.3903 1.9069 1.1141 1.3826 1.4322 2.8868 2.0673 3.3969 1.3876 1.7584 1.6808 1.2685 1.5369 2.2675 1.2317 1.3344 1.0411 1.0411 6.2330 5.5191 5.0940 4.7661 11.8995 11.7647 1.0350 1.0980 1.0983 1.0883 1.0748 1.0774 1.0857 1.0905 1.0921 1.1146
irintensity: 0.6148 0.9864 0.0025 0.7780 1.0229 0.4298 0.8620 1.8172 4.8501 2.1972 0.1616 6.4166 3.7208 8.4284 0.2583 1.4320 1.9587 0.6075 6.9799 3.1530 1.0724 2.6137 4.4305 22.8323 3.7482 0.0137 17.6423 6.7277 4.8772 57.5573 26.0675 6.5499 1.2540 10.1800 6.0671 90.6035 3.8146 58.6330 4.7935 11.5568 22.7245 30.7478 7.0089 3.8988 25.3950 8.5203 6.9084 2.8022 0.7864 2.2279 7.3845 14.0805 15.2258 6.1895 41.1927 4.9687 1.1697 11.1337 129.0757 50.0188 10.2131 8.7677 17.4207 23.8989 10.4129 19.1842 21.0288 4.9665 22.3474
temp: 298.150 k
press: 1.00000 atm
elementType: 16 16 6 6 6 6 6 6 6 6 6 6 6 6 6 1 1 1 1 1 1 1 1 1 1
symmnumber: 1
zpe: 466261.2 jmol-1
zpe.correction: 0.177590 hartree
zpe.thermalcorrener: 0.194547 hartree
zpe.thermalcorrenthalpy: 0.195491 hartree
zpe.thermalcorrgfe: 0.129630 hartree
zpe.sumelectzpe: -1296.288710 hartree
zpe.sumelectthermal: -1296.271752 hartree
zpe.sumelectthermalent: -1296.270808 hartree
zpe.sumelectthermalfe: -1296.336669 hartree
dipole: 0.3782 -2.3341 -0.0930
dipole: 2.3664
quadrupole: -57.6680 -95.7409 -109.2287
quadrupole: -6.8395 -0.6130 0.2843
quadrupole: 29.8779 -8.1950 -21.6829 -6.8395 -0.6130 0.2843
hfenergy: -1296.4662992 hartree
pointgroup: C01 [X(C13H10S2)]
dipole: -0.1701445 -0.9096283 0.1020321 debye
dipolederiv: 0.1784266 0.0955898 0.0708496 0.264377 -0.1819158 0.0449955 0.1383124 0.0164038 -0.0038399 0.1722598 -0.0583042 0.0950849 -0.169355 -0.2142145 0.0262994 -0.0290017 0.0369437 -0.0027559 0.0625014 -0.0604969 -0.0125868 -0.075171 -0.1597652 0.0049455 -0.1628357 0.0060361 -0.1493374 -0.3409631 0.0958902 -0.0405848 0.3202938 -0.1262508 -0.0119113 -0.3341584 -0.0011422 -0.1466768 0.2401726 -0.1602045 -0.1170501 -0.4278416 0.5262603 0.0595848 -0.1935438 0.0342292 -0.0672069 0.5758292 0.0941534 -0.1022094 -0.0850306 0.5547222 -0.2246423 -0.1381256 -0.1954809 -0.0044527 -0.4009535 0.1108898 0.0265639 0.2940021 -0.2230982 -0.010658 0.2346978 -0.0177195 -0.0241078 -0.9170623 -0.1071138 0.0413446 -0.1507034 -0.2394947 0.0593416 0.35504 0.0723221 -0.0389654 0.1385859 0.0675575 -0.0011461 0.3981144 0.1347339 -0.0243439 -0.044803 -0.024624 -0.1448377 0.1743421 -0.0253932 -0.00994 -0.1581563 -0.1130565 0.0108377 -0.0041224 0.009578 -0.0492735 0.0270827 -0.0504218 -0.0080234 -0.3009711 0.1045516 -0.0084912 0.033164 -0.0177746 -0.122188 0.6700227 0.1023817 -0.0273307 0.1180277 -0.1116009 -0.0107513 -0.0491418 -0.0124948 -0.1288344 -0.1034092 -0.0199945 0.0130557 -0.1825738 0.0986994 0.0021155 0.0312872 0.0069787 0.0880797 0.3087843 -0.0155741 -0.0094839 0.4758392 0.0928444 -0.0211243 -0.0423845 -0.0072919 -0.1230947 -0.4548536 0.1556568 -0.0159808 0.0420322 0.0466025 -0.0293525 0.0010598 -0.033099 -0.413718 0.0267522 0.0476116 0.0228825 0.1002134 -0.0353099 -0.0083986 0.0817139 0.0023096 0.1684188 0.0177261 -0.0187386 0.02332 -0.0751909 -0.0447282 0.0646262 0.1091718 0.0520589 0.1566904 -0.0498259 -0.070341 0.0122395 -0.1014768 -0.0292503 0.014031 -0.0105836 0.0195394 0.177173 0.0055368 -0.0310504 0.0065795 -0.0906312 -0.0638496 0.0162554 0.0082166 0.0135068 0.1674942 -0.0655349 0.0390751 -0.0047025 0.1120016 -0.0359928 0.0320963 -0.0222067 0.0304107 0.1270224 -0.1259245 -0.0481141 -0.0299603 -0.0600637 0.0341376 -0.0978922 -0.09848 -0.101046 0.0260995 -0.1017572 -0.0301722 0.0402661 -0.0121187 0.1042451 0.0659462 0.1051072 0.0669462 -0.0429176 0.0230812 -0.0022598 0.0051121 -0.1593528 -0.1044441 0.0196255 0.0132301 0.0157033 0.1612051 -0.1285796 -0.0292594 0.0118345 -0.0154788 0.0699983 0.0083319 0.0119622 0.006864 0.1931398 0.0677603 -0.0813672 0.0098658 -0.0607857 -0.083824 0.0185332 0.0064243 0.0208423 0.1968837 unknown
polarizability: 715.8760359|-20.7193301|152.4986152|1.8790918|-5.3748929|79.6121215 unknown
InChI: InChI=1S/C13H10S2/c1-3-5-6-7-9-13-11-10-12(8-4-2)14-15-13/h3,5-6,10-11H,1H2,2H3
charge 0 multiplicity 1
25 atoms
S  -0.799633 1.859945 0.422207
S  -2.714421 1.492952 -0.774178
C  -0.733055 -0.955848 0.092391
C  -2.164529 -1.100896 0.223071
C  0.014352 0.213738 0.107556
C  -3.148261 -0.168431 -0.062491
C  1.416035 0.281628 0.024894
C  -4.541949 -0.402412 0.026709
C  4.057766 0.583464 -0.079509
C  2.658096 0.405047 -0.021806
C  4.994247 -0.435365 -0.054815
C  -5.775097 -0.536355 0.066711
C  -7.230356 -0.70749 0.126265
C  6.425571 -0.19451 -0.120867
C  7.374612 -1.180694 -0.095871
H  -0.157061 -1.886397 0.003192
H  -2.523697 -2.087086 0.545689
H  4.417362 1.621705 -0.151463
H  4.651271 -1.476415 0.016687
H  -7.748655 0.252148 -0.053701
H  -7.581503 -1.430961 -0.633141
H  -7.546736 -1.081908 1.117726
H  6.746871 0.855368 -0.194191
H  8.443691 -0.950611 -0.1465
H  7.09838 -2.239916 -0.023462
