program: Gaussian 09
title: 000182498
version: EM64L-G09RevD.01
frameworkgroup: C1[X(C17H18N2O5)]
method: RPBEPBE
basis: SDD
operation: Freq
keyword: #p
keyword: freq=noraman
keyword: PBEPBE/SDD
title: #p freq=noraman PBEPBE/SDD
converged: YES YES NO NO
title: Mulliken charges:
elementType: O O O O O N N C C C C C C C C C C C C C C C C C H H H H H H H H H H H H H H H H H H
charge: -0.273168 -0.271396 -0.306336 -0.196175 -0.343167 -0.647769 -0.013967 -0.288995 0.366166 -0.227184 0.066564 0.144367 0.227442 -0.384773 0.206054 0.152922 -0.354537 -0.251582 -0.163019 -0.224402 -0.256695 -0.250327 -0.670156 -0.668918 0.299403 0.318324 0.248345 0.260117 0.231540 0.235743 0.331118 0.394347 0.227454 0.237655 0.219756 0.235335 0.223471 0.252948 0.222134 0.217188 0.254090 0.220082
chargesum: 0.00000
title: Mulliken charges with hydrogens summed into heavy atoms:
elementType: O O O O O N N C C C C C C C C C C C C C C C C C
charge: -0.273168 -0.271396 -0.306336 -0.196175 -0.343167 0.077696 -0.013967 0.010408 0.366166 0.091140 0.066564 0.144367 0.227442 -0.136428 0.206054 0.152922 -0.094420 -0.020041 -0.163019 0.011341 0.208414 0.204764 0.028398 0.022442
polarizability: 2.50215119e+02 -8.80624658e+00 2.41179949e+02 -8.41425917e+00 -2.02606728e+01 1.44716234e+02
1716.lowfreq: -6.7909 -4.8325 -3.4995 -0.0005 -0.0003 0.0006 26.6236 30.0027 38.4943
frequency: 26.5154 29.8392 38.4623 42.8538 64.8914 65.2802 71.3447 83.4730 97.9567 104.9411 123.4207 131.0093 139.2159 152.1278 193.2815 219.3989 229.5580 256.2359 286.3337 286.7636 297.3858 320.2313 326.5805 349.1984 358.8426 376.3767 410.6186 416.5864 452.7009 463.9447 469.4667 483.5134 519.9212 530.7854 558.0953 594.1173 611.9711 640.4203 667.7028 694.0219 705.0048 719.1838 732.0198 759.6086 772.8016 780.8420 788.0555 802.9483 806.8010 815.8101 824.9372 852.0193 868.8754 896.2252 932.1738 951.9750 974.7067 985.5804 995.8575 1019.6018 1031.0605 1034.3731 1048.5826 1093.3840 1094.5069 1102.7773 1123.8887 1152.5178 1155.7925 1158.2701 1171.2706 1198.9715 1222.3843 1229.3917 1236.5822 1275.4144 1280.3594 1282.5073 1290.2888 1321.2910 1332.1800 1358.3866 1361.4355 1385.7424 1388.4487 1390.3800 1403.0411 1446.7637 1455.9792 1456.1675 1463.6827 1465.6069 1477.4373 1483.9698 1486.5149 1507.2105 1591.5240 1595.0052 1625.0489 1643.0948 1653.7433 2206.1813 2990.6543 2991.2535 3003.4418 3030.2609 3030.6743 3038.7375 3083.6200 3084.6294 3092.8850 3093.1809 3117.4138 3119.6656 3137.8906 3150.3162 3163.4733 3177.1820 3334.6900 3644.2966
redmass: 5.1472 4.2958 3.4566 4.3483 4.0727 5.8141 5.5216 5.9699 3.9299 4.8005 4.3717 5.0252 4.3007 6.4052 6.8124 1.3153 1.3231 4.9803 4.5014 2.8451 2.6865 5.2902 4.5431 4.0833 4.9330 7.7997 6.0971 3.8889 4.7877 3.5752 4.2322 1.2689 4.2154 5.2743 5.5637 6.8228 6.9195 8.4809 5.1816 4.3672 4.3969 4.3684 3.8479 1.5932 2.1730 1.6509 2.3927 3.0739 1.4319 1.6978 3.4627 3.9153 1.4683 4.9602 5.0044 1.3964 3.7941 1.3224 3.2454 3.0645 3.5999 2.2484 2.9885 2.1972 2.1399 2.0809 3.0544 1.6606 1.6364 1.4524 1.1064 1.9077 2.0080 1.8993 2.5821 1.2758 1.1145 1.1178 2.1323 1.6348 1.9979 1.2747 1.5503 5.1238 1.2722 1.2369 3.4209 2.3890 1.1036 1.1313 1.0472 1.0430 2.3855 1.0518 1.0771 2.5127 2.9970 4.3165 6.6913 8.7748 6.5244 12.5561 1.0361 1.0359 1.0808 1.0601 1.0587 1.0848 1.0983 1.0975 1.1026 1.1025 1.1061 1.1065 1.0855 1.0901 1.0951 1.0999 1.0599 1.0919
irintensity: 0.2812 0.7060 0.1512 1.2675 3.8948 2.0737 0.1440 0.8909 0.4095 0.2637 0.7425 3.8739 0.5110 0.8736 0.6653 2.7644 1.7214 1.3778 1.2446 1.0447 6.0086 3.3658 1.1517 16.1833 18.8873 5.7479 4.4345 0.8260 5.4061 0.1304 1.4160 147.6398 5.2885 6.2907 4.3830 0.9680 1.8795 4.8721 32.7231 3.5641 3.8599 4.4030 4.5216 25.2809 43.3080 97.4332 58.2403 6.9929 4.9780 1.7535 1.0068 1.9318 3.4660 3.0616 10.9676 2.5734 87.4102 0.3279 4.5940 153.8801 135.6770 62.0392 166.9515 24.9819 37.7170 28.9584 264.7607 44.0633 13.7144 29.6137 13.0483 211.1139 10.2517 135.1207 8.7411 39.4511 2.6689 4.9526 108.9239 14.4703 28.1742 1.5894 14.4845 5.0104 35.1281 20.2345 28.0777 92.8408 24.2524 34.3795 17.8946 15.9972 164.0317 11.7124 18.5424 391.2185 59.6080 53.1799 55.7925 211.1584 432.3175 5.1504 21.0458 14.5930 10.6912 26.7093 39.8768 2.2049 39.6539 45.7193 7.1979 3.4130 27.7453 28.2106 0.6200 10.6282 14.4677 11.8703 150.1223 114.3655
temp: 298.150 k
press: 1.00000 atm
elementType: 8 8 8 8 8 7 7 6 6 6 6 6 6 6 6 6 6 6 6 6 6 6 6 6 1 1 1 1 1 1 1 1 1 1 1 1 1 1 1 1 1 1
symmnumber: 1
zpe: 850161.1 jmol-1
zpe.correction: 0.323809 hartree
zpe.thermalcorrener: 0.347419 hartree
zpe.thermalcorrenthalpy: 0.348364 hartree
zpe.thermalcorrgfe: 0.269130 hartree
zpe.sumelectzpe: -1142.476940 hartree
zpe.sumelectthermal: -1142.453330 hartree
zpe.sumelectthermalent: -1142.452386 hartree
zpe.sumelectthermalfe: -1142.531619 hartree
dipole: 0.3651 1.8598 -4.8421
dipole: 5.1998
quadrupole: -127.7797 -110.5124 -158.6480
quadrupole: -0.6777 -9.4402 -2.7956
quadrupole: 4.5337 21.8010 -26.3346 -0.6777 -9.4402 -2.7956
hfenergy: -1142.8007492 hartree
pointgroup: C01 [X(C17H18N2O5)]
dipole: -0.4105664 -0.6767237 1.8864402 debye
polarizability: 254.3051235|4.5355242|234.9253798|11.0972443|-23.5946247|146.8807984 unknown
InChI: InChI=1S/C17H18N2O5/c1-3-22-16(20)11(9-18)13-10-7-5-6-8-12(10)24-15(19)14(13)17(21)23-4-2/h5-8,11,13H,3-4,19H2,1-2H3
charge 0 multiplicity 1
42 atoms
O  1.032482 2.573967 0.045639
O  -0.46223 -3.045687 0.311263
O  -2.96697 -0.052549 0.665266
O  1.121531 -2.841142 -1.394464
O  -3.212604 2.246501 0.282031
N  -0.975856 3.635601 -0.135247
N  0.493979 0.360511 -2.959617
C  -0.203449 -0.052358 0.512203
C  1.261224 0.230345 0.814357
C  -0.389393 -0.942738 -0.812923
C  -0.997559 1.235052 0.37013
C  1.825207 1.49366 0.529233
C  -0.353739 2.449893 0.097428
C  2.122504 -0.750469 1.363506
C  0.208126 -2.351132 -0.700426
C  -2.444417 1.234563 0.427086
C  3.187713 1.784516 0.725335
C  3.491344 -0.486666 1.579369
C  0.110005 -0.244517 -2.006997
C  4.028112 0.779952 1.246809
C  -0.068142 -4.479299 0.507149
C  -4.453786 -0.158839 0.747175
C  1.14653 -4.60665 1.42951
C  -5.066214 -0.362648 -0.64189
H  -0.644629 -0.675686 1.309747
H  -1.48772 -1.066855 -0.893663
H  1.708742 -1.729473 1.627001
H  3.563791 2.780788 0.475955
H  4.137816 -1.263617 2.00003
H  5.091718 0.98826 1.401818
H  -0.4241 4.47148 -0.314263
H  -2.00784 3.617248 -0.111612
H  -0.971614 -4.931226 0.946129
H  0.136737 -4.919285 -0.484725
H  -4.61616 -1.029711 1.402939
H  -4.844866 0.75689 1.223135
H  1.352029 -5.676488 1.619064
H  2.042881 -4.165516 0.962182
H  0.960854 -4.118755 2.402527
H  -6.15932 -0.504522 -0.550295
H  -4.886168 0.518993 -1.279191
H  -4.645049 -1.256188 -1.135399
