program: Gaussian 09
title: 000190826
version: EM64L-G09RevD.01
frameworkgroup: C1[X(C12H24N2O4S2)]
method: RPBEPBE
basis: SDD
operation: Freq
keyword: #p
keyword: freq=noraman
keyword: PBEPBE/SDD
title: #p freq=noraman PBEPBE/SDD
converged: NO YES NO NO
title: Mulliken charges:
elementType: S S O O O O N N C C C C C C C C C C C C H H H H H H H H H H H H H H H H H H H H H H H H
charge: 0.030181 0.030345 -0.434598 -0.434764 -0.226648 -0.226678 -0.659205 -0.659903 -0.001747 -0.001028 -0.371916 -0.372214 -0.403046 -0.403218 -0.738159 -0.738273 -0.473429 -0.473212 0.181974 0.181904 0.202791 0.203195 0.233679 0.228854 0.233513 0.228850 0.222168 0.212419 0.222276 0.212316 0.271006 0.269800 0.271024 0.270295 0.256159 0.236740 0.255723 0.236823 0.284714 0.302704 0.284963 0.302763 0.375382 0.375481
chargesum: 0.00000
title: Mulliken charges with hydrogens summed into heavy atoms:
elementType: S S O O O O N N C C C C C C C C C C C C
charge: 0.030181 0.030345 -0.059216 -0.059283 -0.226648 -0.226678 -0.071788 -0.072178 0.201044 0.202167 0.090616 0.090148 0.031541 0.031373 -0.197353 -0.196954 0.019470 0.019334 0.181974 0.181904
polarizability: 2.55564187e+02 -3.50143236e-02 1.73929434e+02 -2.37776661e+01 -3.61482889e-02 1.67403845e+02
1716.lowfreq: -3.5777 -0.0020 0.0012 0.0018 2.6266 5.3543 7.8800 10.5499 17.0076
frequency: 7.7578 10.4445 16.9879 20.4271 24.5503 34.6783 39.3059 54.5682 58.9798 90.5134 90.9377 91.1042 105.8523 132.7271 140.3524 188.6826 196.4145 197.9805 202.6202 212.2760 235.3590 274.8197 276.3691 280.0985 292.2304 364.9521 366.8271 412.2665 416.6018 416.8078 469.0594 470.1474 491.1234 492.1952 525.2587 525.7773 539.6729 543.6529 618.1093 618.6752 657.7745 661.8490 708.2014 708.7148 749.2612 750.6685 781.9716 782.0006 815.7840 816.1700 918.5347 919.2127 939.3425 940.4721 963.5621 965.2350 998.0805 998.8976 1038.0490 1038.2534 1069.1076 1070.2297 1088.9885 1089.3831 1100.4587 1102.9250 1137.7133 1137.9634 1176.8445 1177.3462 1203.1486 1204.6635 1224.8457 1228.5724 1237.9452 1242.6201 1269.8806 1270.5625 1287.0570 1287.2311 1299.0341 1300.7801 1319.2708 1320.0570 1336.4219 1338.1181 1355.2303 1355.5718 1360.1247 1360.3796 1426.8220 1429.3329 1450.8144 1450.9875 1457.5771 1457.7480 1464.1078 1464.5464 1626.5867 1627.4742 1672.3967 1672.7089 2898.9566 2901.1330 2980.6348 2981.0451 2984.6794 2985.1159 3001.0001 3002.0970 3031.9249 3032.2062 3045.6260 3045.9846 3052.1289 3052.4235 3078.4000 3079.5907 3104.9965 3105.0947 3491.9774 3493.3561 3504.9677 3505.1048 3628.6838 3630.2645
redmass: 8.0398 5.4964 4.8995 6.3762 7.6305 7.6591 7.5044 5.5060 6.1109 2.9503 3.3923 2.8150 3.6820 2.5799 5.4617 2.3656 1.8685 2.3598 1.9116 1.7741 2.9575 5.1425 3.5281 3.2440 5.7811 2.9798 2.9781 15.6807 2.4113 2.4417 1.9721 1.9888 2.5863 2.6246 3.4021 3.5736 1.3052 1.2712 1.2824 1.2850 4.2518 4.5357 3.4463 3.4648 1.2905 1.3166 2.2095 2.2224 3.2768 3.2852 2.1504 2.2107 2.6403 2.7180 1.7923 1.7338 1.8584 1.8605 2.2046 2.2068 2.6339 2.6153 2.5999 2.5187 1.2873 1.2418 2.3018 2.3000 1.2043 1.2043 1.2072 1.2187 1.4242 1.4454 1.3077 1.2848 1.4447 1.4422 1.1933 1.1892 1.2959 1.2869 1.4300 1.4453 1.4407 1.4233 1.3648 1.3447 1.4585 1.4864 1.0924 1.0901 1.0896 1.0895 1.1257 1.1256 1.0843 1.0837 1.1038 1.1039 7.7704 7.7699 1.0828 1.0828 1.0601 1.0599 1.0612 1.0612 1.0576 1.0581 1.0610 1.0610 1.0994 1.0994 1.1007 1.1008 1.1056 1.1049 1.1044 1.1043 1.0446 1.0446 1.0638 1.0638 1.1012 1.1013
irintensity: 0.2510 1.4965 0.0611 0.2942 0.5192 2.1388 0.0121 1.0467 0.5258 2.7293 2.7120 1.8282 6.4189 0.1442 2.2175 6.9068 52.0020 12.0047 20.7761 3.7509 2.3100 4.1981 0.9285 3.3465 0.2110 4.3408 0.1611 0.0541 11.8172 2.3579 33.5254 0.4869 3.7738 2.4564 27.4794 65.1422 269.5418 42.8902 235.7985 73.6143 0.8927 9.2580 66.7045 34.7545 5.9538 2.0775 4.3117 9.6145 7.0967 11.0335 8.4831 2.5517 72.3774 38.6404 0.2518 3.7259 12.2205 14.7310 91.2545 89.2714 19.7014 27.6993 65.0526 109.2105 3.7339 2.6775 4.5976 0.4002 24.1114 28.1801 4.5293 2.6702 20.7072 0.0263 14.3652 0.1308 10.7658 6.0577 0.6095 2.4708 7.7764 0.1861 14.9661 61.7664 16.6877 5.3246 10.3852 6.6163 13.4681 1.6833 7.6605 1.4744 4.1893 3.8309 31.9293 14.1445 4.1932 31.4585 97.0797 45.1233 465.0060 29.9344 51.1170 52.5262 6.3020 7.3660 27.3888 34.1003 28.4186 16.6313 19.3374 15.7089 3.0509 6.1772 23.4155 51.1954 8.6573 26.1782 6.4891 6.3825 3.7190 3.5798 16.8749 18.3844 15.9211 16.2835
temp: 298.150 k
press: 1.00000 atm
elementType: 16 16 8 8 8 8 7 7 6 6 6 6 6 6 6 6 6 6 6 6 1 1 1 1 1 1 1 1 1 1 1 1 1 1 1 1 1 1 1 1 1 1 1 1
symmnumber: 1
zpe: 947862.1 jmol-1
zpe.correction: 0.361022 hartree
zpe.thermalcorrener: 0.386732 hartree
zpe.thermalcorrenthalpy: 0.387676 hartree
zpe.thermalcorrgfe: 0.297329 hartree
zpe.sumelectzpe: -1676.583015 hartree
zpe.sumelectthermal: -1676.557304 hartree
zpe.sumelectthermalent: -1676.556360 hartree
zpe.sumelectthermalfe: -1676.646708 hartree
dipole: -0.0110 2.6554 -0.0052
dipole: 2.6554
quadrupole: -178.3333 -130.3209 -140.8363
quadrupole: -0.1184 10.7870 -0.0093
quadrupole: -28.5031 19.5093 8.9939 -0.1184 10.7870 -0.0093
hfenergy: -1676.9440364 hartree
pointgroup: C01 [X(C12H24N2O4S2)]
dipole: 0.0040873 -1.0446811 0.0096776 debye
polarizability: 256.5146529|0.1979358|173.9292321|21.9235674|-0.0519596|166.4535812 unknown
InChI: InChI=1S/C12H24N2O4S2/c13-9(1-3-11(15)16)5-7-19-20-8-6-10(14)2-4-12(17)18/h9-10,15,17H,1-8,13-14H2
charge 0 multiplicity 1
44 atoms
S  0.342642 2.074175 1.057845
S  -0.349853 2.055573 -1.106792
O  5.741285 -2.558269 -0.234709
O  -5.721049 -2.545863 0.276997
O  7.490189 -1.562584 0.91927
O  -7.492259 -1.589093 -0.875916
N  3.483873 -0.633559 -1.259337
N  -3.48091 -0.598593 1.277195
C  3.975032 0.127325 -0.094433
C  -3.976719 0.130842 0.094674
C  2.985478 1.276556 0.235025
C  -2.991483 1.274486 -0.265989
C  5.392577 0.709407 -0.359348
C  -5.396128 0.714571 0.34655
C  1.72436 0.772771 0.951097
C  -1.732062 0.756769 -0.975018
C  6.396066 -0.332155 -0.933429
C  -6.395387 -0.316669 0.946154
C  6.63605 -1.489324 0.010089
C  -6.635266 -1.494257 0.028636
H  4.046258 -0.532579 0.802274
H  -4.047469 -0.552244 -0.784277
H  2.705097 1.772711 -0.716065
H  3.483594 2.039646 0.861484
H  -2.708678 1.793742 0.672056
H  -3.493944 2.021496 -0.90815
H  5.305899 1.521379 -1.106832
H  5.797293 1.146848 0.574798
H  -5.312858 1.545006 1.07394
H  -5.802542 1.127504 -0.597969
H  1.926252 0.518795 2.009147
H  1.297816 -0.117978 0.457749
H  -1.935318 0.481872 -2.027538
H  -1.304576 -0.123994 -0.464881
H  5.988794 -0.704315 -1.887496
H  7.367454 0.159236 -1.112738
H  -5.982839 -0.6673 1.906152
H  -7.36727 0.176168 1.118423
H  2.538725 -0.418079 -1.579863
H  3.7319 -1.624899 -1.273318
H  -2.538295 -0.368713 1.594822
H  -3.724474 -1.590204 1.317156
H  5.93263 -3.290649 0.412948
H  -5.908287 -3.289452 -0.358985
