program: Gaussian 09
title: 000182493
version: EM64L-G09RevD.01
frameworkgroup: C1[X(C20H22O5)]
method: RPBEPBE
basis: SDD
operation: Freq
keyword: #pfreq=noraman
keyword: PBEPBE/SDD
title: #p freq=noraman PBEPBE/SDD
converged: NO YES NO NO
title: Mulliken charges:
elementType: O O O O O C C C C C C C C C C C C C C C C C C C C H H H H H H H H H H H H H H H H H H H H H H
charge: -0.203174 -0.229739 -0.196725 -0.204969 -0.205611 0.369131 -0.238492 0.242108 -0.194320 -0.497298 -0.535061 -0.484430 -0.546251 0.220575 -0.432692 -0.815069 -0.472871 -0.100720 0.139936 -0.365503 0.084920 0.334402 -0.365809 -0.334074 -0.179353 0.209283 0.221375 0.233531 0.243979 0.245685 0.225129 0.234071 0.230892 0.231679 0.218519 0.228939 0.219472 0.233347 0.211668 0.269442 0.232031 0.226381 0.225509 0.256141 0.278835 0.269766 0.265413
chargesum: 0.00000
title: Mulliken charges with hydrogens summed into heavy atoms:
elementType: O O O O O C C C C C C C C C C C C C C C C C C C C
charge: -0.203174 -0.229739 -0.196725 -0.204969 -0.205611 0.369131 -0.029208 0.242108 0.027054 -0.019788 -0.064247 -0.019467 -0.096052 0.220575 0.015719 -0.100611 -0.014458 0.124789 0.139936 -0.109362 0.084920 0.334402 -0.086973 -0.064308 0.086060
polarizability: 2.64685542e+02 -1.58071033e-03 1.88937332e+02 -9.48274975e+00 -7.98704663e+00 1.90803614e+02
1716.lowfreq: -12.3829 -9.7802 -0.0006 0.0004 0.0007 8.5228 24.7164 30.1465 60.7156
frequency: 24.4659 30.0859 60.6930 68.4665 88.2726 103.5628 121.4323 143.2845 163.4535 173.5191 198.1657 206.7998 229.9599 233.7632 250.2134 275.3343 289.7391 299.7319 312.8040 329.0686 344.3594 353.6995 371.4414 438.2146 457.0601 465.8874 489.5700 493.8547 512.3673 530.8203 570.3334 581.4981 586.9073 600.8080 625.5021 642.3416 667.8838 683.4393 712.4679 726.2976 727.2594 753.0035 771.8400 791.7828 807.5939 813.1931 833.6871 852.5553 863.1459 873.1684 887.3251 898.2934 913.7534 922.7784 929.3209 935.8477 946.4617 964.6312 976.3742 979.9117 984.1509 990.5371 1010.7890 1022.0378 1028.3075 1050.3650 1054.2986 1059.1052 1083.7589 1102.6249 1110.9458 1127.8870 1135.6500 1138.4707 1156.0249 1162.3018 1171.3433 1187.2543 1195.2048 1215.0919 1222.6253 1235.4704 1238.5476 1249.3614 1254.9369 1283.0345 1286.0431 1292.4520 1299.2770 1308.1770 1311.3035 1316.5418 1331.3992 1336.0127 1342.5704 1347.4789 1353.8764 1366.3355 1386.3284 1403.2437 1446.4004 1462.5924 1469.0739 1471.0525 1475.9344 1484.2177 1486.5548 1496.4572 1500.5434 1586.5301 1679.1254 1693.1622 1697.7482 2948.1268 2953.0732 2954.3514 2963.2937 2987.9508 2989.6961 2996.6643 2998.5700 2998.6858 3009.1581 3016.4800 3050.8956 3053.6287 3070.7209 3074.2219 3081.1880 3092.9575 3096.2107 3119.4333 3233.4929 3257.5953 3274.0018
redmass: 4.3829 5.3232 4.2543 5.5381 4.8058 5.8355 5.8139 3.1104 4.1360 3.7156 4.4533 3.5962 3.5663 4.0321 4.0271 2.3768 3.7697 2.7948 2.4731 3.1693 1.8372 2.6317 2.6324 3.0023 4.7398 4.0559 4.0284 3.9949 4.0508 3.9174 4.1698 5.1296 3.9439 5.1273 4.0328 3.7957 3.5661 3.2624 3.5048 1.7048 2.0356 2.8160 1.9821 2.8094 2.2335 1.8902 3.3231 5.9346 2.9855 1.3692 2.7633 1.7523 2.4701 4.3959 3.8838 3.1594 1.9658 2.7438 2.2778 2.3753 3.0437 2.8767 2.1742 2.4225 3.0716 2.6396 2.2547 2.2806 3.3112 2.5089 1.8261 2.0060 2.5676 2.1610 1.8256 2.3003 1.9308 1.7523 1.4724 1.6264 1.3081 1.4778 1.5812 1.3891 1.3617 1.4589 1.4577 1.3603 1.3617 1.4270 1.1761 1.4274 1.4342 1.4083 1.4305 1.6766 1.4039 1.5572 3.8462 1.1909 1.0850 1.0779 1.0838 1.0816 1.0795 4.4979 1.0718 1.0756 1.0522 6.1534 11.5787 9.2072 11.2530 1.0832 1.0835 1.0648 1.0786 1.0465 1.0518 1.0633 1.0757 1.0694 1.0658 1.0718 1.0986 1.1019 1.1015 1.1000 1.0982 1.0999 1.1029 1.0918 1.0929 1.0986 1.1090
irintensity: 0.2795 2.2866 1.7595 2.1112 4.2535 4.7235 1.1943 0.4653 1.3173 1.6880 0.0345 1.6813 0.6085 4.7030 1.5548 0.1806 2.1359 2.5230 0.3055 2.4600 0.7238 0.5751 0.7652 0.3676 2.7690 1.3763 0.7091 2.6324 6.5316 1.0695 4.1123 3.3160 9.2064 2.0213 3.2736 0.5147 5.2428 23.5337 15.5915 10.6529 1.6502 32.1984 35.3447 26.6968 4.4248 3.0456 24.1693 16.1710 31.7900 4.9557 11.7426 0.9910 72.3689 85.3214 23.0136 99.9009 1.0953 28.5525 11.0549 40.4133 9.2638 55.6609 30.4932 0.6820 61.4202 5.1916 6.8830 14.2611 97.9597 10.0372 5.2470 4.6455 10.3963 35.1407 24.7714 8.7296 28.3236 35.3439 16.5184 13.9802 1.8353 10.9383 9.0380 1.2487 13.6892 19.3267 6.9926 14.0314 7.1519 4.3116 10.7477 2.1335 9.2982 7.4139 0.2833 0.3405 5.6206 25.8679 1.7810 21.6677 23.7811 9.3613 11.6576 0.7921 5.3199 17.8498 6.1326 7.1577 7.4130 2.7771 286.9872 64.3646 335.7310 16.4139 15.9221 26.0060 16.1431 15.0217 16.0747 72.5344 11.6578 6.4360 13.9030 43.0934 10.2051 20.1724 37.0586 5.7507 27.3107 23.6657 28.8790 6.4292 0.8527 0.7836 0.0407
temp: 298.150 k
press: 1.00000 atm
elementType: 8 8 8 8 8 6 6 6 6 6 6 6 6 6 6 6 6 6 6 6 6 6 6 6 6 1 1 1 1 1 1 1 1 1 1 1 1 1 1 1 1 1 1 1 1 1 1
symmnumber: 1
zpe: 1000200.4 jmol-1
zpe.correction: 0.380956 hartree
zpe.thermalcorrener: 0.402124 hartree
zpe.thermalcorrenthalpy: 0.403068 hartree
zpe.thermalcorrgfe: 0.331139 hartree
zpe.sumelectzpe: -1149.557715 hartree
zpe.sumelectthermal: -1149.536547 hartree
zpe.sumelectthermalent: -1149.535603 hartree
zpe.sumelectthermalfe: -1149.607532 hartree
dipole: 1.3653 -0.5534 4.2563
dipole: 4.5041
quadrupole: -172.9040 -166.8832 -143.7119
quadrupole: -23.5562 -20.1194 -1.8538
quadrupole: -11.7376 -5.7168 17.4544 -23.5562 -20.1194 -1.8538
hfenergy: -1149.9386712 hartree
pointgroup: C01 [X(C20H22O5)]
dipole: -0.5329986 0.5176526 1.6087453 debye
polarizability: 264.7465423|2.3532352|191.9191141|8.8662327|7.8453216|187.760832 unknown
InChI: InChI=1S/C20H22O5/c1-19-9-15(12-6-8-23-10-12)25-18(22)13(19)5-7-20-11-24-17(21)14(20)3-2-4-16(19)20/h3,6,8,10,13,15-16H,2,4-5,7,9,11H2,1H3
charge 0 multiplicity 1
47 atoms
O  2.980982 1.359769 -2.140602
O  -2.622308 -1.385863 -0.305968
O  -1.637415 -3.447476 -0.534072
O  5.201353 1.698345 -1.48809
O  -5.381665 2.19132 0.470577
C  -0.182403 -0.498692 0.836085
C  1.263216 0.136275 1.040964
C  2.156868 0.061822 -0.240222
C  -0.169382 -1.452589 -0.420328
C  2.344241 -1.428363 -0.720278
C  1.09083 -2.324346 -0.485523
C  2.092763 -0.469753 2.219151
C  -1.251519 0.607401 0.541109
C  3.520754 0.688182 0.040512
C  1.718863 0.972915 -1.435386
C  -0.656602 -1.277866 2.096424
C  3.396701 0.317725 2.509173
C  -2.388343 0.107574 -0.398853
C  -1.485385 -2.215783 -0.448719
C  4.097181 0.801761 1.26291
C  4.061556 1.290733 -1.207529
C  -3.728367 0.748216 -0.173493
C  -4.987251 0.296563 -0.742536
C  -4.011948 1.894534 0.552535
C  -5.959485 1.184749 -0.329619
H  1.116651 1.211714 1.283825
H  -0.181991 -0.805736 -1.322644
H  3.215203 -1.866661 -0.201685
H  2.608209 -1.411728 -1.794696
H  0.994967 -3.073478 -1.290672
H  1.184667 -2.901258 0.452848
H  2.345776 -1.522156 1.992804
H  1.490248 -0.486333 3.142289
H  -1.675535 0.958283 1.499309
H  -0.781814 1.480998 0.049219
H  1.09739 0.479786 -2.197445
H  1.23181 1.904193 -1.087913
H  -0.025471 -2.15692 2.312678
H  -0.644066 -0.620639 2.984508
H  -1.694651 -1.630099 1.971785
H  4.085419 -0.305345 3.114838
H  3.177093 1.204769 3.142102
H  -2.079672 0.276793 -1.452335
H  5.065607 1.312214 1.355699
H  -5.128684 -0.59667 -1.346795
H  -3.419937 2.593683 1.135542
H  -7.032157 1.263336 -0.477986
