program: Gaussian 09
title: 000190841
version: EM64L-G09RevD.01
frameworkgroup: C1[X(C16H15INO6P)]
method: RPBEPBE
basis: SDD
operation: Freq
keyword: #p
keyword: freq=noraman
keyword: PBEPBE/SDD
title: #p freq=noraman PBEPBE/SDD
converged: YES YES NO NO
title: Mulliken charges:
elementType: I P O O O O O O N C C C C C C C C C C C C C C C C H H H H H H H H H H H H H H H
charge: 0.090722 1.208853 -0.540823 -0.677248 -0.583088 -0.258298 -0.456553 -0.241270 -0.330994 -0.675630 -0.631622 0.424571 0.257983 0.376106 -0.338614 -0.422209 -0.433267 -0.330644 0.282144 -0.156389 -0.152195 -0.182660 -0.371358 -0.376428 0.129154 0.298240 0.316280 0.258580 0.242538 0.357638 0.253440 0.244381 0.286483 0.278642 0.286734 0.252299 0.402468 0.241131 0.276161 0.394742
chargesum: 0.00000
title: Mulliken charges with hydrogens summed into heavy atoms:
elementType: I P O O O O O O N C C C C C C C C C C C C C C C C
charge: 0.090722 1.208853 -0.540823 -0.274780 -0.583088 -0.258298 -0.061811 -0.241270 0.026644 -0.061111 -0.130503 0.424571 0.257983 0.376106 -0.085174 -0.177828 -0.146784 -0.052002 0.282144 0.130345 0.100104 0.058471 -0.095197 -0.376428 0.129154
polarizability: 2.92789412e+02 2.89001788e+01 2.89913907e+02 1.58530890e+01 5.88824752e+00 1.52460491e+02
1716.lowfreq: -5.0161 -3.6014 0.0006 0.0010 0.0011 6.8073 10.1067 14.3528 15.7182
frequency: 8.5927 14.1601 15.5112 24.4755 37.9471 41.6871 44.6128 61.0272 73.7032 79.1962 108.7233 140.9015 153.5820 156.0532 177.4218 189.0704 210.8251 222.4152 229.1484 250.4537 266.4796 279.9107 324.5687 333.5098 350.8048 361.5242 379.9733 392.4293 405.9054 421.5970 424.3374 473.5135 491.0453 500.8545 548.5656 562.7946 591.4137 603.1582 609.8766 619.6916 629.2647 656.5491 665.1532 675.7719 684.2354 715.2491 722.4273 733.6803 756.2258 797.6811 820.3772 838.5932 845.6263 851.3678 902.3792 924.9837 928.8221 940.5927 960.0580 976.2759 981.0790 982.4651 989.9434 992.1409 999.3016 1009.7951 1054.3196 1057.1539 1090.6324 1108.1190 1115.4547 1122.4966 1176.9063 1177.9255 1193.8054 1200.8564 1208.2231 1224.2586 1241.9901 1285.6409 1295.6272 1309.4804 1314.4082 1321.5126 1367.4435 1390.4324 1392.2349 1418.4721 1427.9926 1449.0987 1470.3531 1474.5032 1480.1337 1573.5592 1583.6850 1594.3142 1609.3721 1622.3771 1649.1992 3003.1564 3019.9117 3065.4416 3098.8093 3127.3326 3130.9272 3149.4673 3157.7717 3167.1839 3168.5233 3180.5888 3208.2242 3528.4931 3531.0640 3601.0157
redmass: 7.6128 7.4652 9.5738 6.9465 6.0098 5.5803 9.1343 9.6218 7.5019 6.8511 7.5472 7.3406 5.4312 7.2492 4.9119 7.4704 5.1169 4.8850 4.5175 3.6990 3.3344 2.5652 2.3386 3.2854 5.0946 7.2890 4.5310 7.1761 2.8770 6.5272 3.0251 5.1625 3.4698 5.8317 3.4389 3.7041 4.1554 5.5216 1.6207 5.7605 5.4019 4.2095 1.2606 6.6592 2.4408 5.3073 4.8945 4.0262 5.3214 2.5695 1.5011 1.5969 2.7278 1.4400 5.8504 1.5757 1.9644 1.4103 1.3968 1.4757 1.4311 2.3457 4.9104 5.7386 1.3604 3.1814 4.8982 2.5464 1.6138 3.0840 1.6915 1.4746 1.3465 1.1084 2.7809 1.1847 1.9746 1.2592 1.8906 1.3261 1.4923 1.3877 2.4060 1.2645 6.7777 9.7498 2.4357 1.0813 3.0981 1.1174 2.5740 2.2507 1.8098 7.0258 6.5943 5.9453 6.7514 7.4019 8.7964 1.0624 1.0583 1.0982 1.1049 1.0898 1.0900 1.0877 1.0963 1.0958 1.0933 1.0989 1.0919 1.0642 1.0782 1.0664
irintensity: 0.0496 0.5231 0.7186 0.5832 3.7311 0.8591 0.0541 2.6479 6.3440 1.9347 1.0044 0.9275 1.2530 1.5335 8.4834 2.6577 1.2581 6.6685 8.3563 12.9819 38.9934 11.2353 21.5015 52.9725 20.4784 26.0173 29.8957 48.7401 1.1111 16.9911 8.8382 23.0050 16.0427 6.2695 18.6776 5.0850 26.2819 35.8000 106.5551 2.2187 2.2132 95.2398 119.1251 58.5366 2.6479 39.8252 57.8475 76.1794 62.7216 40.8332 32.9526 14.2341 21.9863 25.5777 132.0014 7.3978 11.0637 2.9469 1.0618 24.8580 1.3438 29.6694 6.3581 59.6767 1.4852 258.0554 124.2510 14.3238 4.3154 2.5894 1.3543 153.1399 43.4574 2.0956 124.9218 7.7184 6.8760 10.1749 123.4786 10.9616 2.6556 20.9584 105.5301 2.1763 1.5984 2.8780 11.1254 30.9743 25.1645 56.2857 79.8084 82.8158 185.4140 4.6420 105.7569 1.4333 20.7615 259.1826 276.3490 13.3652 19.7907 2.2783 9.7293 10.9104 7.9887 7.2697 2.2888 7.5039 3.1701 3.0314 5.8441 46.2756 39.1563 52.8018
temp: 298.150 k
press: 1.00000 atm
elementType: 53 15 8 8 8 8 8 8 7 6 6 6 6 6 6 6 6 6 6 6 6 6 6 6 6 1 1 1 1 1 1 1 1 1 1 1 1 1 1 1
symmnumber: 1
zpe: 749468.8 jmol-1
zpe.correction: 0.285458 hartree
zpe.thermalcorrener: 0.310678 hartree
zpe.thermalcorrenthalpy: 0.311622 hartree
zpe.thermalcorrgfe: 0.223557 hartree
zpe.sumelectzpe: -1475.748020 hartree
zpe.sumelectthermal: -1475.722800 hartree
zpe.sumelectthermalent: -1475.721856 hartree
zpe.sumelectthermalfe: -1475.809921 hartree
dipole: 2.1094 -1.7734 1.8701
dipole: 3.3305
quadrupole: -178.2002 -164.7139 -171.6846
quadrupole: -12.4373 -2.2897 -6.1487
quadrupole: -6.6674 6.8190 -0.1517 -12.4373 -2.2897 -6.1487
hfenergy: -1476.0334779 hartree
pointgroup: C01 [X(C16H15I1N1O6P1)]
dipole: 0.1033452 -0.9018307 -0.9449387 debye
polarizability: 309.4572948|-5.8583632|254.5585884|42.8134528|28.9154772|171.1479267 unknown
InChI: InChI=1S/C16H15INO6P/c17-13-6-4-11(5-7-13)8-15(19)18-10-25(22,23)24-14-3-1-2-12(9-14)16(20)21/h1-7,9,18,20,22H,8,10H2
charge 0 multiplicity 1
40 atoms
I  -3.45161 -3.226959 -2.337138
P  2.595381 1.461206 -0.892119
O  1.399616 1.37327 0.392173
O  1.793683 0.745638 -2.263039
O  3.206005 2.90444 -1.174793
O  3.628214 -1.440392 1.964227
O  -3.528309 0.59566 -0.010385
O  -4.571666 2.652761 0.25726
N  2.968903 -1.225368 -0.256371
C  3.704834 0.006515 -0.439875
C  2.101741 -3.144752 1.063903
C  0.820769 -3.155309 0.242541
C  2.948304 -1.860954 0.985241
C  0.28465 2.254826 0.433048
C  -0.191261 -2.188386 0.481066
C  0.590933 -4.138274 -0.751421
C  -0.994093 1.692111 0.264506
C  0.456705 3.634584 0.691382
C  -2.133837 2.525195 0.376454
C  -1.401473 -2.198106 -0.246232
C  -0.616267 -4.167644 -1.489826
C  -0.689329 4.457108 0.791721
C  -1.98093 3.911691 0.640551
C  -1.602604 -3.194196 -1.227634
C  -3.511069 1.98671 0.212714
H  4.436365 -0.049778 -1.265173
H  4.22153 0.243469 0.505671
H  1.883388 -3.279476 2.138079
H  2.755847 -3.988039 0.769209
H  2.363178 -1.561918 -1.009715
H  -0.033637 -1.416439 1.244136
H  1.353047 -4.900948 -0.952345
H  -1.095338 0.628836 0.042369
H  1.464437 4.045026 0.806422
H  -2.167225 -1.441332 -0.048978
H  -0.777637 -4.938851 -2.24834
H  1.40824 1.389122 -2.909842
H  -0.567635 5.526384 0.991976
H  -2.87656 4.535492 0.720414
H  -4.470989 0.302876 -0.134638
