program: Gaussian 09
title: 000190794
version: EM64L-G09RevD.01
frameworkgroup: C1[X(C15H20O4)]
method: RPBEPBE
basis: SDD
operation: Freq
keyword: #pfreq=noraman
keyword: PBEPBE/SDD
title: #p freq=noraman PBEPBE/SDD
converged: YES YES NO NO
title: Mulliken charges:
elementType: O O O O C C C C C C C C C C C C C C C H H H H H H H H H H H H H H H H H H H H
charge: -0.468833 -0.243480 -0.423863 -0.222438 0.332044 -0.283141 -0.200724 -0.244331 -0.473370 -0.826220 0.409673 0.483095 -0.582908 -0.430573 0.100436 -0.537241 -0.833231 -0.842452 0.217073 0.236574 0.275641 0.263723 0.220827 0.230358 0.256460 0.222780 0.240426 0.246572 0.242677 0.216351 0.260880 0.225017 0.226336 0.235636 0.237395 0.241363 0.245154 0.368022 0.378293
chargesum: 0.00000
title: Mulliken charges with hydrogens summed into heavy atoms:
elementType: O O O O C C C C C C C C C C C C C C C
charge: -0.100811 -0.243480 -0.045570 -0.222438 0.332044 -0.046567 0.074917 0.019392 -0.022185 -0.106554 0.409673 0.483095 -0.093660 -0.214222 0.100436 -0.276361 -0.146242 -0.118539 0.217073
polarizability: 1.85767814e+02 4.58410050e+00 1.91488323e+02 -1.22745753e+01 -1.09111003e+01 1.27974015e+02
1716.lowfreq: -10.3507 0.0004 0.0007 0.0008 7.9936 14.4129 48.1611 67.9501 76.4053
frequency: 48.1539 67.9368 76.3989 82.8706 103.7929 145.0643 152.7939 156.8886 172.6101 188.1934 192.6740 232.9567 245.6988 253.1244 277.3380 292.5559 298.9815 318.4027 337.0000 356.6571 379.9522 405.2129 420.3416 426.8546 459.1134 487.9915 500.2850 549.5884 567.1538 577.8953 593.1434 603.9805 626.6385 652.7681 685.1352 687.0139 764.8908 801.1746 814.1966 844.3869 861.4669 884.2652 918.0233 931.8448 937.8967 959.0177 973.1717 986.2695 1004.0375 1026.0506 1031.8797 1038.5959 1050.1250 1060.0857 1064.0634 1093.5423 1109.0821 1152.8359 1163.1230 1173.1411 1175.7288 1201.5854 1217.1885 1229.5940 1256.2117 1264.9127 1266.2593 1290.4515 1291.5747 1304.0095 1322.4586 1331.5775 1344.6693 1345.8193 1356.3536 1370.2212 1389.6144 1391.1048 1402.5295 1451.4382 1451.7531 1460.2265 1466.4477 1468.1788 1471.1208 1484.9908 1491.7013 1574.0957 1628.7405 1670.3889 1693.5757 2905.1076 2930.8489 2951.1255 2965.6396 2971.1474 2988.9079 2992.0602 3010.1507 3014.8249 3036.2716 3045.2406 3078.6779 3080.2217 3085.9851 3092.5137 3093.7650 3098.2542 3136.6066 3386.3180 3516.4209
redmass: 5.2219 6.4941 9.0107 2.8345 6.6864 1.6538 1.5991 3.1838 4.5375 3.4939 1.3562 2.8780 1.9256 1.5426 3.0161 2.8895 2.0543 5.2881 4.4694 3.7253 3.3373 3.1130 3.4381 3.2202 4.3756 1.8410 1.5431 3.7459 3.4609 2.9789 2.9791 1.6489 4.3932 3.0426 4.2282 3.1779 2.9907 2.9428 1.3534 2.3436 3.0953 2.1171 2.3773 1.9034 2.1520 2.0670 2.3555 1.9957 1.5837 2.5299 1.9490 2.1029 1.7599 1.8353 2.6343 2.3259 3.0825 1.6563 2.1567 1.8010 1.8319 1.7428 1.5331 1.4357 1.5715 1.4459 1.3659 1.4087 1.5806 1.5222 1.6642 1.6734 2.1163 1.7081 1.7031 1.6134 1.2193 1.2344 1.2261 1.0750 1.0785 1.0668 1.0680 1.0777 1.0592 1.0555 1.0568 8.8322 6.7405 8.7147 6.7544 1.0785 1.0797 1.0642 1.0375 1.0383 1.0822 1.0365 1.0945 1.0608 1.0961 1.0951 1.1005 1.0989 1.0987 1.0990 1.0995 1.0906 1.0921 1.0641 1.0638
irintensity: 0.1034 1.0556 1.1854 0.1459 4.1782 0.5448 1.0240 1.1052 1.1474 0.0746 1.0516 0.5375 0.1313 0.4365 4.9532 1.6414 3.1710 22.2619 4.2532 1.6374 4.0454 1.9750 1.0356 2.6450 7.4027 77.0211 53.2507 1.5778 5.1251 20.1565 21.7886 76.5094 15.9778 1.5175 7.7230 45.8929 6.9828 1.5092 9.1882 21.1014 24.6878 10.3550 4.0722 7.3814 8.0928 6.3685 6.0362 36.9208 12.2360 26.3681 9.9070 44.2968 1.6142 127.2554 96.9623 7.2160 49.6266 6.9204 14.0916 7.9253 5.1655 15.6053 17.6977 5.3716 13.9345 41.7275 17.4108 8.2448 31.7468 7.8860 16.2062 8.4834 31.3073 13.0043 22.2505 35.4020 45.0450 27.5758 16.0150 18.2529 2.6298 17.8945 29.0634 2.1492 18.3191 0.4346 2.3957 116.7142 143.3917 214.6473 2.1654 14.2162 22.4449 36.4464 33.1928 13.5852 4.2783 21.1070 29.6267 12.3031 22.5278 12.4262 14.7290 20.7371 21.4682 23.0297 12.0449 40.1883 10.7469 45.1508 24.1408
temp: 298.150 k
press: 1.00000 atm
elementType: 8 8 8 8 6 6 6 6 6 6 6 6 6 6 6 6 6 6 6 1 1 1 1 1 1 1 1 1 1 1 1 1 1 1 1 1 1 1 1
symmnumber: 1
zpe: 841638.3 jmol-1
zpe.correction: 0.320563 hartree
zpe.thermalcorrener: 0.339500 hartree
zpe.thermalcorrenthalpy: 0.340444 hartree
zpe.thermalcorrgfe: 0.275125 hartree
zpe.sumelectzpe: -883.031595 hartree
zpe.sumelectthermal: -883.012658 hartree
zpe.sumelectthermalent: -883.011714 hartree
zpe.sumelectthermalfe: -883.077033 hartree
dipole: 2.6158 4.2689 -2.7318
dipole: 5.7034
quadrupole: -115.5552 -113.2296 -114.0950
quadrupole: 6.1098 -0.8948 4.4915
quadrupole: -1.2619 1.0637 0.1983 6.1098 -0.8948 4.4915
hfenergy: -883.3521579 hartree
pointgroup: C01[X(C15H20O4)]
dipole: -0.5060077 2.0607224 0.7296506 debye
polarizability: 181.4025651|-4.4954245|196.0496249|-14.5996165|-0.0198674|127.7779628 unknown
InChI: InChI=1S/C15H20O4/c1-8-4-5-10-9(2)6-12(16)14(19)15(10,3)11(8)7-13(17)18/h4,6,10-11,14,17,19H,5,7H2,1-3H3
charge 0 multiplicity 1
39 atoms
O  -0.021481 -2.448921 -0.542875
O  -2.662801 -2.616959 -0.109636
O  1.942166 -2.325796 1.949278
O  3.237504 -2.189461 0.02514
C  -0.235224 0.029658 -0.49109
C  -0.88434 1.16345 0.38037
C  1.323738 0.227608 -0.504884
C  -0.625053 -1.329671 0.156896
C  -0.613992 2.554702 -0.251252
C  -0.744455 0.054828 -1.957319
C  1.695951 1.66968 -0.865873
C  -2.362327 0.925608 0.70376
C  2.049189 -0.182783 0.826346
C  0.815765 2.699239 -0.729325
C  -2.150242 -1.492261 0.197304
C  -2.927219 -0.324016 0.615431
C  3.090842 1.882917 -1.423153
C  -3.185913 2.105054 1.171672
C  2.473951 -1.640402 0.846022
H  -0.358539 1.158229 1.365151
H  1.731161 -0.436637 -1.293967
H  -0.281702 -1.342362 1.216375
H  -0.843554 3.355752 0.47835
H  -1.30256 2.718467 -1.108026
H  -0.405437 -0.862763 -2.468547
H  -1.847054 0.092133 -2.014055
H  -0.341576 0.923533 -2.504353
H  2.98065 0.406328 0.91074
H  1.439228 0.046112 1.715258
H  1.130014 3.711279 -1.022267
H  -3.990103 -0.484647 0.830025
H  3.874912 1.476079 -0.755334
H  3.30647 2.953048 -1.586564
H  3.208735 1.355503 -2.39019
H  -2.71145 2.594014 2.045206
H  -4.205027 1.797553 1.458412
H  -3.266967 2.880141 0.386419
H  -0.750259 -3.125393 -0.662956
H  2.200295 -3.285343 1.886315
