program: Gaussian 09
title: 000182483
version: EM64L-G09RevD.01
frameworkgroup: C1[X(C10H7N5OS)]
method: RPBEPBE
basis: SDD
operation: Freq
keyword: #p
keyword: freq=noraman
keyword: PBEPBE/SDD
title: #p freq=noraman PBEPBE/SDD
converged: NO NO NO NO
title: Mulliken charges:
elementType: S O N N N N N C C C C C C C C C C H H H H H H H
charge: 0.199152 -0.189889 -0.399025 -0.479251 -0.014407 0.017308 0.050482 0.096616 0.225642 -0.084719 0.268883 -0.240531 -0.216611 -0.198575 -0.384918 -0.127228 -0.486430 0.317352 0.307295 0.268011 0.288555 0.254557 0.255175 0.272555
chargesum: 0.00000
title: Mulliken charges with hydrogens summed into heavy atoms:
elementType: S O N N N N N C C C C C C C C C C
charge: 0.199152 -0.189889 -0.081673 -0.171956 -0.014407 0.017308 0.050482 0.096616 0.225642 -0.084719 0.268883 -0.240531 0.051400 0.089981 -0.130361 0.127947 -0.213875
polarizability: 2.53330755e+02 8.63193906e-01 1.58313662e+02 -5.79842761e+00 4.46655373e+00 9.03158908e+01
1716.lowfreq: -3.6859 -0.0019 -0.0018 -0.0012 3.0479 8.4455 22.5067 38.1177 45.6386
frequency: 22.3515 38.1128 45.6224 81.9497 124.3290 164.7447 198.5303 218.1358 244.3856 303.2682 316.9733 385.7557 441.8167 496.8288 515.4981 529.5827 555.7157 566.5728 583.1096 586.9125 611.8582 635.5584 660.4902 690.0804 702.6497 710.4233 720.4212 792.0914 810.2111 826.0986 842.8008 858.0150 866.2296 900.9408 930.0501 934.3871 971.1115 1033.5188 1063.1430 1074.8327 1093.1002 1122.5131 1189.5118 1223.4519 1241.7913 1252.4398 1297.2058 1314.0680 1332.9334 1337.3285 1350.5808 1412.7554 1427.6410 1460.5158 1467.1507 1512.0414 1543.8318 1592.5732 1615.9507 3175.7712 3182.0824 3199.5747 3235.3815 3237.6554 3509.8783 3586.0776
redmass: 7.6273 6.4358 7.2223 7.3294 8.0603 5.7603 8.0057 5.8760 6.0720 7.0810 6.7481 11.2285 5.7268 3.4013 1.5106 10.1306 3.1953 4.1875 2.0302 6.1195 1.8893 8.4579 5.7385 7.0486 2.7647 2.7353 2.6875 7.1638 5.6892 6.2502 1.6172 2.1395 2.2584 7.5857 1.4483 1.4079 5.9152 1.9093 2.0716 2.6482 1.2856 4.1782 2.2253 2.0923 2.0562 7.6477 3.7540 2.3181 3.5506 3.2440 2.2717 1.9008 2.7464 5.9866 2.5914 6.6252 5.9435 8.3979 6.9152 1.0924 1.0900 1.0979 1.0991 1.1008 1.0770 1.0821
irintensity: 0.3834 0.3968 5.8321 4.7567 5.5021 0.4904 3.5824 3.4193 0.8283 4.7106 12.2338 0.2845 1.7441 14.0836 103.7559 7.7710 1.6169 19.0882 110.1619 4.6391 11.1803 4.8438 1.8957 2.6608 7.4837 29.1288 125.4207 0.4599 8.3147 11.0345 20.5433 12.8875 4.0265 4.1420 16.0296 1.3574 5.8362 11.4482 104.5917 17.8896 39.3784 3.3921 65.9558 47.3651 217.5322 7.9624 79.8400 31.7720 157.2456 14.5397 97.7191 157.4864 144.0294 42.7976 345.8465 101.0612 52.0888 196.9667 177.1356 14.2120 3.8479 1.2450 0.7515 0.3050 10.3984 41.6824
temp: 298.150 k
press: 1.00000 atm
elementType: 16 8 7 7 7 7 7 6 6 6 6 6 6 6 6 6 6 1 1 1 1 1 1 1
symmnumber: 1
zpe: 430469.7 jmol-1
zpe.correction: 0.163957 hartree
zpe.thermalcorrener: 0.177574 hartree
zpe.thermalcorrenthalpy: 0.178518 hartree
zpe.thermalcorrgfe: 0.121099 hartree
zpe.sumelectzpe: -1131.112644 hartree
zpe.sumelectthermal: -1131.099028 hartree
zpe.sumelectthermalent: -1131.098084 hartree
zpe.sumelectthermalfe: -1131.155503 hartree
dipole: -6.0442 -7.0037 0.7672
dipole: 9.2830
quadrupole: -112.9959 -97.8612 -105.6124
quadrupole: -4.6238 3.7737 -3.6102
quadrupole: -7.5060 7.6286 -0.1226 -4.6238 3.7737 -3.6102
hfenergy: -1131.2766016 hartree
pointgroup: C01 [X(C10H7N5O1S1)]
dipole: 2.3191265 2.8209102 0.0526021 debye
dipolederiv: -0.1982217 0.1148882 -0.160321 0.1308889 -0.0390029 0.1849168 -0.0948225 0.1696023 -0.0562051 -0.8002887 -0.1103264 0.1090359 0.1886841 -0.6956562 0.2930477 -0.0180854 0.3028253 -0.4996036 -0.5857669 -0.1342273 -0.036795 0.1259606 -0.5170345 -0.0751665 0.0597414 -0.0688388 -0.2444519 -2.3521494 0.1076019 -0.1475719 0.3155091 -0.3506396 0.0073986 -0.3021625 0.0036072 -0.4416478 -0.3604553 0.0680518 0.0110993 -0.1258243 -0.6105353 -0.1137504 -0.0337391 -0.0954255 -0.2951448 -0.6696309 -0.1371365 -0.0142008 -0.3727129 -0.5652266 -0.1259965 0.0313991 -0.1291479 -0.182976 -0.4552052 0.0589514 0.0266297 -0.1739113 -0.4708812 -0.1071706 -0.0700902 -0.0490642 -0.218644 -0.9442748 0.1982473 0.0343133 -0.0445264 0.2738265 0.0692119 -0.1083066 0.0717019 0.0996747 2.0325816 0.0894857 0.0472494 0.3672733 0.446469 0.1833093 -0.1234438 0.1309507 0.1953032 0.5373015 -0.4017197 -0.1001098 0.121252 0.5278403 0.1459973 0.0220091 0.1027993 0.1215322 2.6773887 0.1264564 -0.0819596 -0.6703617 0.8459849 -0.420807 0.18482 -0.3713646 0.5301336 -0.9105527 -0.2087798 0.1480555 -0.077006 0.049076 -0.3016368 -0.0210546 -0.2730267 0.0890955 0.7912153 0.1773609 0.0754527 0.2351375 0.2338861 0.0829916 0.0887271 0.0768044 -0.0092391 0.173059 0.180146 -0.1575986 -0.0137273 -0.0409298 -0.0319472 0.0170808 -0.0039084 -0.0805594 0.4192791 0.1300486 0.0092216 0.1785086 0.5592365 0.1535924 0.104717 0.1259778 -0.0151549 -0.0329374 -0.0403504 0.0610214 -0.1061295 -0.2131499 0.0773919 0.1166971 0.0715766 -0.2056888 0.0465094 -0.1485912 0.2329052 -0.0918462 -0.1103904 -0.1808864 0.136946 -0.1974165 -0.0669218 0.1468846 -0.0100608 -0.0029228 -0.0160766 0.2316099 -0.03802 -0.0199903 -0.0391803 0.3286449 0.1671038 -0.0069921 -0.0172172 0.0507544 0.1019451 0.0742988 0.1145073 0.0638174 0.2829621 0.1118142 0.0130488 0.0038771 0.0176742 0.0185226 -0.0474464 0.0041036 -0.0468102 0.1618455 0.1489984 -0.0039317 -0.0101545 -0.0047084 0.0999849 0.0871904 0.0128166 0.0811007 0.1093236 0.0725989 -0.0190478 -0.0071008 -0.0391995 -0.0498601 -0.0489532 -0.0205882 -0.0479024 0.1179934 -0.0425433 0.0086495 -0.0436283 0.0386142 0.1460229 0.0515563 -0.0705956 0.0462215 0.136926 0.0272918 -0.0517727 0.0207192 -0.0342267 0.1289017 0.0808778 -0.0106864 0.0751003 0.1428025 unknown
polarizability: 253.4454638|3.033534|157.6447485|-0.0261095|-8.4566819|90.8700957 unknown
InChI: InChI=1S/C10H7N5OS/c16-10(6-2-1-3-17-6)15-9-7-8(12-4-11-7)13-5-14-9/h1-5,11,15H
charge 0 multiplicity 1
24 atoms
S  3.163611 1.222215 -1.182949
O  1.378876 -1.692282 1.035313
N  -2.1557 1.883211 0.459923
N  0.425129 0.120712 -0.130496
N  -4.280827 1.065105 0.186536
N  -1.185677 -1.608646 -0.54448
N  -3.613608 -1.242382 -0.449518
C  -2.003496 0.552135 0.056754
C  -0.91882 -0.323927 -0.193644
C  -3.344184 0.049941 -0.102827
C  1.51817 -0.643609 0.352948
C  2.85857 -0.088337 0.043476
C  -3.536495 2.130438 0.51114
C  4.054179 -0.496909 0.624964
C  -2.499108 -2.002285 -0.635137
C  5.211024 0.206063 0.140493
C  4.915628 1.16167 -0.8214
H  -1.420501 2.536792 0.725834
H  0.620594 1.06362 -0.477784
H  -3.93671 3.100448 0.800001
H  4.076282 -1.288011 1.377511
H  -2.659869 -3.05044 -0.90133
H  6.227401 0.009311 0.488351
H  5.587933 1.824769 -1.363382
