program: Gaussian 09
title: 000190856
version: EM64L-G09RevD.01
frameworkgroup: C1[X(C24H21NO8)]
method: RPBEPBE
basis: SDD
operation: Freq
keyword: #p
keyword: freq=noraman
keyword: PBEPBE/SDD
title: #p freq=noraman PBEPBE/SDD
converged: YES YES NO NO
title: Mulliken charges:
elementType: O O O O O O O O N C C C C C C C C C C C C C C C C C C C C C C C C H H H H H H H H H H H H H H H H H H H H H
charge: -0.225071 -0.273741 -0.221300 -0.434296 -0.426273 -0.444772 -0.425861 -0.425825 -0.515409 -0.065764 0.289468 0.353457 0.349149 0.154379 0.306395 -0.451752 0.159496 0.159342 0.086187 0.462726 -0.654452 -0.379439 -0.331682 -0.324292 -0.433047 -0.362610 -0.465522 -0.548675 -0.513744 -0.395477 -0.432448 0.314464 0.323684 0.255963 0.267832 0.335698 0.275799 0.249075 0.248474 0.224448 0.248702 0.253828 0.164140 0.234892 0.238158 0.256878 0.284404 0.254913 0.224696 0.348379 0.357250 0.350501 0.359716 0.358962
chargesum: 0.00000
title: Mulliken charges with hydrogens summed into heavy atoms:
elementType: O O O O O O O O N C C C C C C C C C C C C C C C C C C C C C C C C
charge: -0.225071 -0.273741 -0.221300 -0.085917 -0.069023 -0.094272 -0.066145 -0.066863 -0.179712 -0.065764 0.289468 0.353457 0.349149 0.154379 0.306395 -0.195789 0.159496 0.159342 0.086187 0.462726 -0.386620 -0.103641 -0.082607 -0.075818 0.040103 0.055357 0.007528 -0.291797 -0.229340 -0.140564 -0.207752 0.314464 0.323684
polarizability: 3.98686548e+02 1.68492496e+00 3.26368689e+02 -3.15315771e+01 -8.06615951e-01 2.22212313e+02
1716.lowfreq: -16.3490 -4.5991 -0.0005 0.0003 0.0005 4.1346 11.7203 19.0579 26.0652
frequency: -6.9807 18.8501 26.0511 42.8528 47.8905 58.2117 73.3402 93.0926 98.7903 102.7579 111.2819 137.5377 155.3661 161.8288 172.3978 185.5672 188.9026 199.8783 209.1785 242.4226 246.7250 251.1285 271.6480 283.3507 296.9414 301.6615 319.6805 332.2700 343.5433 345.9060 357.0140 360.9898 367.9541 377.3096 382.1433 412.7220 420.1343 445.4529 460.4307 463.4281 471.8705 486.2214 502.9745 522.8204 535.3565 565.0781 583.1725 589.2068 591.6336 600.3318 602.1485 610.9792 632.8145 655.9306 677.3089 696.2709 705.9283 715.7679 718.8286 735.7722 743.8916 751.9554 759.2586 768.7816 775.0279 805.0944 829.2099 838.9495 840.4831 857.5411 864.3046 877.3862 894.0492 906.9940 912.0705 927.7812 940.4697 941.7625 951.0486 962.6625 967.1364 975.4434 979.4009 983.9176 1003.2709 1030.0293 1065.0875 1082.5372 1095.6886 1100.9881 1106.7118 1127.3675 1132.2413 1145.9963 1162.7707 1169.6196 1176.2874 1181.3941 1191.1591 1216.7889 1217.5830 1244.8499 1255.3463 1261.2538 1273.7673 1277.2000 1288.5996 1309.1969 1312.2491 1321.3605 1325.5898 1334.0386 1354.1923 1366.2470 1374.4278 1378.6781 1396.5583 1407.9884 1430.6414 1444.8868 1451.3912 1454.7299 1465.6315 1466.3237 1487.4231 1494.9075 1499.9135 1508.6584 1583.0162 1590.9995 1603.0672 1628.7542 1633.4642 1646.4239 1678.4589 2919.6797 2994.2811 3003.0525 3076.5773 3079.8478 3109.9771 3126.2465 3135.8418 3140.2271 3146.4578 3148.3106 3154.1876 3172.9983 3181.5065 3189.1777 3444.7709 3530.9038 3573.0994 3582.3316 3584.0438 3585.2808
redmass: 5.7515 6.1150 5.4686 6.2047 6.8659 6.4931 6.5807 5.5133 4.9249 3.2980 5.5495 4.6049 4.8999 6.5012 6.4794 5.0578 5.3543 4.9463 5.1558 9.3671 5.7219 3.9937 5.7402 1.4330 2.6089 1.8718 7.0039 2.3198 2.3134 4.7190 5.5418 1.1246 4.7075 1.1757 4.1565 4.4872 3.1826 3.9381 3.2201 4.2655 3.4169 1.4702 4.1885 5.6993 4.3079 4.6961 5.3353 6.7206 8.2524 5.2567 5.5453 4.1721 3.9576 6.0403 2.8107 3.2725 2.4763 4.9760 3.5564 6.9519 7.8399 5.4418 4.2448 4.0422 2.3059 1.7258 1.8370 1.5458 1.5761 2.5980 1.5859 2.0458 1.5681 3.9565 5.3088 2.1209 4.0400 1.3740 2.5599 1.3634 1.6058 3.0505 3.7810 3.3854 4.3067 4.0513 1.5750 2.9841 1.9990 1.9249 1.8580 1.8103 1.6102 1.3768 1.3059 1.3395 1.6631 2.0810 1.7058 1.7486 1.7866 1.8550 2.4147 2.2969 2.2844 3.8774 1.9711 2.0989 1.3245 2.7558 1.2508 1.4267 2.0899 1.2633 1.2126 1.4012 7.1097 7.4483 4.0705 4.0828 4.0893 1.0738 1.0907 1.0831 2.1701 3.1702 3.1595 2.0956 7.2407 6.0136 7.7645 7.0582 7.5151 7.2885 12.9527 1.0698 1.0660 1.0580 1.1075 1.0929 1.0991 1.0885 1.0921 1.0903 1.0898 1.0918 1.0957 1.0937 1.0958 1.0930 1.0754 1.0654 1.0665 1.0661 1.0670 1.0661
irintensity: 0.5584 0.3315 0.0263 1.0455 2.3279 2.0078 1.4214 5.4085 2.8831 3.3631 4.2734 10.4974 0.8364 1.7044 1.7949 4.7523 2.9623 15.1803 6.1809 2.2211 14.5364 17.8605 2.9155 86.3102 78.5592 69.0893 1.9367 44.5921 73.4835 20.0159 13.4973 128.8407 20.4372 148.1228 9.8879 30.6758 0.7470 2.7770 26.6533 12.6715 2.1490 162.2485 86.1465 3.6353 4.7413 34.6262 5.9366 10.8884 6.0287 20.6703 0.6704 1.6646 9.0859 17.8068 18.2611 35.6697 30.8421 66.4098 1.5865 2.6522 2.1037 0.9811 26.5722 16.6352 116.7092 20.5805 23.7442 30.0927 53.5838 15.8875 41.7161 2.4871 21.9068 12.6257 1.3789 40.4330 4.8028 6.8421 56.6029 3.6732 6.5485 94.0020 104.5802 71.6483 37.3529 190.6540 44.6880 64.8678 45.9745 274.9376 7.8601 11.5486 443.9820 70.4314 56.0262 35.4662 29.6897 28.8935 55.9129 20.2383 2.5704 3.7152 66.6878 13.8857 16.0192 31.6565 41.2562 66.3950 14.5681 214.2449 6.1364 46.0089 13.3733 16.8610 4.5890 15.6590 84.4140 31.5790 136.6786 8.3124 101.8206 11.4306 5.0490 6.1809 18.7571 91.1249 41.9835 424.4368 22.7325 3.6140 141.9998 310.6335 111.3023 72.0893 383.4429 112.7006 35.7073 42.5596 24.0042 15.4170 11.5582 12.3947 8.7687 3.7748 7.8425 1.6903 8.3359 2.1314 4.1280 0.1339 160.7821 9.7662 12.8495 62.1546 16.2037 59.3176
temp: 298.150 k
press: 1.00000 atm
elementType: 8 8 8 8 8 8 8 8 7 6 6 6 6 6 6 6 6 6 6 6 6 6 6 6 6 6 6 6 6 6 6 6 6 1 1 1 1 1 1 1 1 1 1 1 1 1 1 1 1 1 1 1 1 1
symmnumber: 1
zpe: 1066209.0 jmol-1
zpe.correction: 0.406098 hartree
zpe.thermalcorrener: 0.434834 hartree
zpe.thermalcorrenthalpy: 0.435778 hartree
zpe.thermalcorrgfe: 0.347420 hartree
zpe.sumelectzpe: -1581.313145 hartree
zpe.sumelectthermal: -1581.284409 hartree
zpe.sumelectthermalent: -1581.283464 hartree
zpe.sumelectthermalfe: -1581.371823 hartree
dipole: -4.6966 -1.0002 -3.5423
dipole: 5.9671
quadrupole: -153.5293 -165.6743 -228.1573
quadrupole: 3.8478 -20.1845 -3.0265
quadrupole: 28.9243 16.7793 -45.7036 3.8478 -20.1845 -3.0265
hfenergy: -1581.7192423 hartree
pointgroup: C01 [X(C24H21N1O8)]
dipole: -1.8661181 -0.339986 -1.3832546 debye
polarizability: 396.7264347|7.6858293|326.1419243|-35.3788987|7.2237169|224.399191 unknown
InChI: InChI=1S/C24H21NO8/c26-10-23(11-27,12-28)25-13-1-4-17-16(7-13)22(31)33-24(17)18-5-2-14(29)8-20(18)32-21-9-15(30)3-6-19(21)24/h1-9,25-30H,10-12H2
charge 0 multiplicity 1
54 atoms
O  1.789639 -0.170795 2.069973
O  4.37584 0.416325 -0.636191
O  0.333806 -0.566106 3.855336
O  -6.081413 1.820489 -1.555394
O  -4.45012 -1.752904 -2.066512
O  -6.466832 -0.931796 1.71061
O  3.943768 5.233297 -0.382826
O  4.942345 -4.209313 -1.630278
N  -4.053408 -0.622607 0.544443
C  1.672861 0.019976 0.509235
C  0.166593 -0.097535 0.306605
C  2.253505 1.382509 0.199958
C  2.484057 -1.095257 -0.116651
C  -0.490133 -0.334846 1.529405
C  -5.172629 -0.13293 -0.296274
C  -0.591528 -0.02075 -0.875256
C  3.570634 1.520131 -0.299043
C  3.79512 -0.865692 -0.606212
C  0.5087 -0.381176 2.63496
C  -2.666331 -0.409997 0.434233
C  -1.881485 -0.482174 1.624986
C  -1.991765 -0.187435 -0.813274
C  1.538284 2.576955 0.479893
C  2.00309 -2.427381 -0.155681
C  -4.851633 1.210104 -1.018521
C  -5.596844 -1.206847 -1.344251
C  -6.365688 0.118329 0.682133
C  4.170739 2.779142 -0.50885
C  4.6064 -1.900317 -1.107909
C  2.103765 3.844318 0.282383
C  2.785635 -3.48376 -0.649962
C  3.430689 3.94031 -0.209827
C  4.097348 -3.211557 -1.123172
H  -0.108615 0.145929 -1.844074
H  -2.347068 -0.645845 2.603993
H  -4.389434 -0.95309 1.458038
H  -2.566074 -0.186859 -1.743149
H  0.518283 2.500434 0.870552
H  0.99591 -2.635171 0.219943
H  -4.321325 1.893399 -0.325346
H  -4.224582 1.03756 -1.904752
H  -6.241365 -0.746587 -2.111959
H  -6.1611 -2.027171 -0.843678
H  -7.308646 0.213043 0.111929
H  -6.191405 1.041119 1.262963
H  5.192927 2.818924 -0.900522
H  5.611191 -1.687672 -1.478636
H  1.553753 4.761814 0.506187
H  2.389863 -4.506535 -0.66232
H  -6.490078 2.408672 -0.873265
H  -3.840788 -2.16021 -1.396591
H  -6.898152 -1.737233 1.329816
H  4.876677 5.207936 -0.711241
H  4.506215 -5.096269 -1.590557
