program: Gaussian 09
title: 000190764
version: EM64L-G09RevD.01
frameworkgroup: C1[X(C14H16O3)]
method: RPBEPBE
basis: SDD
operation: Freq
keyword: #pfreq=noraman
keyword: PBEPBE/SDD
title: #p freq=noraman PBEPBE/SDD
converged: YES YES NO NO
title: Mulliken charges:
elementType: O O O C C C C C C C C C C C C C C H H H H H H H H H H H H H H H H
charge: -0.197264 -0.174183 -0.201007 0.197138 -0.274084 -0.170097 -0.175232 -0.522136 -0.773877 -0.545424 0.504969 -0.193843 0.087738 -0.208181 -0.521986 0.175768 -0.834865 0.230436 0.245422 0.254629 0.244963 0.218325 0.258516 0.242190 0.209330 0.244603 0.258910 0.220808 0.217896 0.262517 0.244899 0.240844 0.232276
chargesum: 0.00000
title: Mulliken charges with hydrogens summed into heavy atoms:
elementType: O O O C C C C C C C C C C C C C C
charge: -0.197264 -0.174183 -0.201007 0.197138 -0.043648 0.075325 0.079398 -0.058848 -0.063841 -0.041911 0.504969 0.026965 0.087738 0.009715 -0.259469 0.175768 -0.116846
polarizability: 1.81446806e+02 7.84575594e+00 1.58413238e+02 -3.18860630e+00 3.12774249e+00 1.10960146e+02
1716.lowfreq: -4.2008 -0.0003 0.0003 0.0007 11.6834 20.5818 38.5733 101.1131 109.6873
frequency: 37.1817 101.1062 109.6801 120.4572 140.9273 170.8992 201.8839 220.0838 225.9148 242.2215 269.8297 278.5303 310.4470 369.6418 374.8060 391.6156 421.6153 458.3293 469.4937 491.3775 532.7474 547.4185 563.8384 585.4875 597.1942 626.5734 705.8906 712.2301 750.2467 763.1066 825.7936 838.1651 883.6981 898.7685 932.8031 946.0336 964.3463 965.2356 975.9847 980.2977 996.0607 1013.4779 1018.7298 1035.5789 1049.9919 1063.9433 1098.9054 1118.0902 1138.0850 1155.1704 1169.2662 1195.8643 1214.5159 1222.0063 1235.6602 1260.8669 1271.0969 1276.6406 1291.1067 1299.8917 1316.3679 1320.9397 1344.5406 1360.2133 1378.1011 1392.9724 1407.1499 1455.4541 1456.4625 1460.4975 1469.5239 1474.4045 1489.8666 1594.9284 1643.0627 1677.0450 1680.3716 2946.8915 2965.2521 2967.5278 2977.6983 2979.0384 2988.6880 2991.2741 3026.9395 3038.6375 3080.9765 3093.3570 3094.1208 3095.6669 3096.4920 3129.7958 3135.3063
redmass: 5.4440 6.2413 4.1574 1.5491 2.0288 2.3859 3.7925 2.6735 1.8488 1.8437 3.9167 2.6444 3.9711 4.4730 4.5785 3.6275 4.2772 3.5273 3.2258 4.9918 4.4272 4.0116 3.7638 3.5307 4.1070 3.2682 2.3484 2.9139 2.2672 3.2020 3.3784 3.3674 1.5865 2.9403 2.6797 2.1484 2.1656 1.9536 1.8070 1.7229 4.0150 2.2692 2.0128 2.2225 1.9941 2.5270 2.1152 2.7191 2.2989 1.5164 1.7649 1.6467 1.8406 1.5585 1.8350 1.3560 1.2383 1.3609 1.2556 1.6709 1.5268 1.5822 1.8223 1.7621 1.5787 1.2382 1.1917 1.0803 1.0573 1.0721 1.0828 1.0536 1.0536 10.8356 6.6086 10.8980 7.1171 1.0809 1.0607 1.0471 1.0782 1.0780 1.0407 1.0668 1.0963 1.0952 1.0986 1.0884 1.0985 1.0970 1.0944 1.0988 1.0922
irintensity: 0.8587 4.4001 0.6481 0.2287 0.1509 0.2558 1.3829 0.2782 0.4107 1.3553 1.7042 2.2444 0.4404 4.0886 1.6449 5.4571 3.0529 2.4514 1.5940 1.9679 8.6193 0.8552 3.4317 4.9377 2.2948 11.4394 16.2258 27.3654 11.1339 2.0098 20.6854 13.1816 14.2242 3.4101 14.3939 5.4882 17.7250 7.2887 2.6469 3.8671 54.2699 6.2058 32.8351 13.2301 9.7649 5.8497 54.0304 18.1055 35.7098 15.5081 8.1536 68.7704 2.6233 14.7456 38.5019 0.3280 0.7054 3.6546 4.5573 8.0496 7.2248 6.0344 12.7708 6.6635 1.2421 35.5750 23.2043 19.4538 16.3049 7.3103 23.2051 2.0875 8.0049 152.8045 110.1666 315.1434 32.2430 16.3845 6.4385 23.1860 7.8881 22.6846 10.2043 31.0620 30.3075 15.5495 15.5022 1.2857 18.7776 3.0261 32.1842 45.2322 9.0063
temp: 298.150 k
press: 1.00000 atm
elementType: 8 8 8 6 6 6 6 6 6 6 6 6 6 6 6 6 6 1 1 1 1 1 1 1 1 1 1 1 1 1 1 1 1
symmnumber: 1
zpe: 703741.6 jmol-1
zpe.correction: 0.268041 hartree
zpe.thermalcorrener: 0.283080 hartree
zpe.thermalcorrenthalpy: 0.284024 hartree
zpe.thermalcorrgfe: 0.226902 hartree
zpe.sumelectzpe: -767.471914 hartree
zpe.sumelectthermal: -767.456875 hartree
zpe.sumelectthermalent: -767.455931 hartree
zpe.sumelectthermalfe: -767.513054 hartree
dipole: 6.0881 6.8827 0.6738
dipole: 9.2136
quadrupole: -106.6442 -112.5214 -97.8065
quadrupole: -10.9033 2.7498 -5.0247
quadrupole: -0.9868 -6.8641 7.8509 -10.9033 2.7498 -5.0247
hfenergy: -767.7399555 hartree
pointgroup: C01 [X(C14H16O3)]
dipole: -2.3821812 2.7211026 -0.2465873 debye
polarizability: 181.349129|-7.9551616|158.5202374|-3.4263912|-2.8771631|110.9508242 unknown
InChI: InChI=1S/C14H16O3/c1-8-6-11(15)13-14(2)9(7-12(16)17-13)4-3-5-10(8)14/h3-4,6,9-10,13H,5,7H2,1-2H3
charge 0 multiplicity 1
33 atoms
O  1.729818 -1.341804 0.19046
O  -0.245929 -3.089666 0.963117
O  3.89353 -0.809876 -0.35123
C  0.024549 0.30169 -0.590835
C  -1.451717 0.764782 -0.346766
C  1.055741 1.493031 -0.49144
C  0.392514 -0.766568 0.480986
C  -1.61798 1.686156 0.904204
C  0.131366 -0.319155 -2.013555
C  2.375183 1.042473 0.239166
C  -2.417295 -0.412785 -0.240145
C  0.550934 2.742766 0.206736
C  -0.603358 -1.944131 0.570956
C  -0.62875 2.830638 0.869837
C  -2.002163 -1.636385 0.217962
C  2.764816 -0.407778 -0.016053
C  -3.853123 -0.158225 -0.636033
H  -1.744539 1.382302 -1.221335
H  1.344009 1.765582 -1.52617
H  0.426578 -0.293743 1.487289
H  -1.502043 1.094496 1.835804
H  -2.65056 2.08305 0.929392
H  1.157386 -0.660189 -2.232689
H  -0.537204 -1.187881 -2.137981
H  -0.144346 0.438994 -2.769764
H  2.227419 1.160565 1.331555
H  3.223116 1.683378 -0.049178
H  1.236064 3.602663 0.194876
H  -0.895125 3.756559 1.396074
H  -2.705001 -2.471515 0.324344
H  -4.500348 -1.026468 -0.42995
H  -3.917874 0.073081 -1.717985
H  -4.270072 0.719361 -0.105346
